{"text_format":"1","workbook":"xlsx","n_sheets":3,"sheets":["horses","the race","players"],"not_rendered":{"charts":0,"images":10,"macros":1,"external_links":0,"defined_names":1,"comments":0,"pivot_tables":0},"unopened":[],"bounds":{"document_bytes":16777216,"sheet_cells":100000,"rows_first":2000,"rows_last":500,"rows_between":2000,"halvings":0,"cell_chars":16384,"cell_head_chars":4096},"cells_cut":0,"cells_raw":0,"read":"whole","date_system":"1900"}

{"sheet":"horses","index":0,"n_rows":4764,"n_cols":10,"rows_kept":4764,"cut":false,"hidden":true,"merged":[]}
["HORSE","SPEED (fastest horses get up to about 20 meters / second)","STAMINA","STRATEGY","estimated finish time",null,"for distance: uses 1 stamina per turn but max speed is 1/3. at .2 race completion, uses 3 stamina per turn at max speed until run out of stamina then goes to 1/4 speed"]
["D.J.",22,72,"S",48.727272727272727,null,"for sprinter: from start uses 3 stamina per turn at max speed and goes to 1/4 speed when runs out of stamina"]
["Abaccus",20,83,"S",52.333333333333329,null,"each turn: move distance equal to random between (1,speed)"]
["Abbervail Dream",26,91,"S",31.205128205128208,null,"distance of races:"]
["Abby",25,70,"S",40.666666666666657,null,"quarter race: 400 m ",null,"*we will only use this race type"]
["Abdullah",21,76,"S",50.857142857142861,null,"pleasure ride endurance race: 16000 m"]
["Abercrombie",15,90,"S",76.666666666666657,null,"non-competitive trail race: 40000 m"]
["Able Master",18,96,"S",56.888888888888886,null,"competitive trail race: 64000 m"]
["Above and Beyond",27,71,"S",35.592592592592595,null,"endurace race: 100000 m"]
["Above The Clouds",26,108,"S",25.53846153846154]
["Abracadabra",16,77,"S",74.333333333333329,null,{"$f":"MIN(B:B)","v":10},{"$f":"MIN(C:C)","v":40},{"$f":"COUNTIF(D:D,\"S\")","v":3609},{"$f":"MIN(E:E)","v":13.809523809523817}]
["Absent",17,96,"S",62.117647058823529,null,{"$f":"MAX(B:B)","v":28},{"$f":"MAX(C:C)","v":130},{"$f":"COUNTA(D:D)-1","v":4763},{"$f":"MAX(E:E)","v":146.66666666666666}]
["Absolute Bullet Proof",27,92,"D",28.592592592592595,null,{"$f":"AVERAGE(B:B)","v":20.791307999160193},{"$f":"AVERAGE(C:C)","v":87.991601931555749},{"$f":"I11/I12","v":0.7577157253831619},{"$f":"AVERAGE(E:E)","v":49.657475646431848}]
["Abu",19,109,"D",47.877192982456137,null,null,null,"S"]
["Acapella",20,69,"S",57]
["Ace",15,98,"D",74]
["Ace of Spades",18,92,"D",58.222222222222229]
["Acer",19,89,"S",54.543859649122808,null,"NUMBER:"]
["Aces Diamond Rio",22,67,"S",50.393939393939391,null,4763]
["Acker Bilk",21,79,"S",49.857142857142861]
["Acorn",22,80,"S",46.060606060606062]
["Acromantula",26,99,"D",28.53846153846154]
["Ad Alta",16,100,"D",66.666666666666657]
["Adagio",27,92,"D",28.592592592592595]
["Adat",18,116,"D",50.222222222222221]
["Addie Over",21,78,"S",50.19047619047619]
["Admiral",25,105,"D",29]
["Adrian",27,62,"S",38.592592592592595]
["Aeris",22,119,"D",33.060606060606062]
["Aerosmith",19,83,"S",56.543859649122808]
["Aferditie",16,113,"D",62.333333333333336]
["Africa",26,93,"S",30.53846153846154]
["Afterglow",19,95,"D",52.543859649122808]
["Afternoon Delight",27,92,"D",28.592592592592595]
["Aftershock",19,121,"D",43.877192982456137]
["Agape",15,87,"S",77.666666666666657]
["Agent 007",15,71,"S",83]
["Aggie's Diamond",21,84,"S",48.19047619047619]
["Ahlerich",27,92,"D",28.592592592592595]
["Ahwa",26,69,"S",38.53846153846154]
["Ai",22,74,"S",48.060606060606062]
["Aida",27,91,"S",28.925925925925924]
["Aidan",16,106,"D",64.666666666666657]
["Aiko",27,89,"S",29.592592592592595]
["Ain't Misbehavin",19,90,"S",54.210526315789473]
["Air",21,83,"S",48.523809523809526]
["Air Born",19,99,"D",51.210526315789473]
["Air Express",20,64,"S",58.666666666666657]
["Airborne Magic",16,75,"S",75]
["Aitch",17,84,"S",66.117647058823536]
["Akasha",23,81,"S",42.565217391304344]
["Akhademy",24,99,"D",33.666666666666664]
["Al",21,61,"S",55.857142857142861]
["Al Akbar",20,102,"D",46]
["Alacazam",22,75,"S",47.727272727272727]
["Aladdin",19,85,"S",55.877192982456137]
["Alanah",18,100,"D",55.555555555555557]
["Alaska",15,75,"S",81.666666666666657]
["Alberton Star",22,98,"D",40.060606060606062]
["Alcatraz",27,72,"S",35.25925925925926]
["Alex",20,84,"S",52]
["Alexa",19,119,"D",44.543859649122808]
["Alexander the Great",25,100,"S",30.666666666666664]
["Alfie",21,116,"S",37.523809523809518]
["Ali",17,63,"S",73.117647058823536]
["Ali Baba",26,96,"D",29.53846153846154]
["Alia Kazam",27,89,"S",29.592592592592595]
["Alizay",21,87,"S",47.19047619047619]
["All My Heart",21,99,"S",43.19047619047619]
["All Natural",17,87,"S",65.117647058823536]
["All that Jazz",16,80,"S",73.333333333333329]
["Alladin's Treasure",22,70,"S",49.393939393939391]
["All-American Rocket",19,123,"D",43.210526315789473]
["Allegra",21,82,"S",48.857142857142861]
["Allegria",18,95,"S",57.222222222222229]
["Allegro",25,73,"S",39.666666666666664]
["Allison Fast",21,85,"S",47.857142857142861]
["Allouette",19,102,"S",50.210526315789473]
["Alloverdaplace",22,101,"D",39.060606060606062]
["Allstar",20,88,"S",50.666666666666671]
["Ally",18,98,"D",56.222222222222221]
["Almonds",16,76,"S",74.666666666666671]
["Almost Illegal",22,93,"D",41.727272727272727]
["Alomar",19,94,"D",52.877192982456137]
["Alotastuff",26,92,"D",30.871794871794869]
["Alouette",20,72,"S",56]
["Altair",15,74,"S",82]
["Altivo",19,97,"S",51.877192982456137]
["Alto Vito",19,59,"S",64.543859649122808]
["Always",24,84,"S",38.666666666666664]
["Always A Dot",22,100,"D",39.393939393939391]
["Amadeus",20,87,"S",51]
["Amanda",15,90,"S",76.666666666666657]
["Amaretto",17,90,"S",64.117647058823536]
["Amarillo Rose",16,113,"D",62.333333333333336]
["Amazing",20,68,"S",57.333333333333343]
["Amazing Grace",19,101,"S",50.543859649122808]
["Amazon",27,105,"S",24.25925925925926]
["Ambara",19,123,"D",43.210526315789473]
["Ambassador",21,99,"D",43.19047619047619]
["Amber",17,110,"D",57.450980392156858]
["Amber Dancer",20,74,"S",55.333333333333336]
["Ambition",17,85,"S",65.784313725490193]
["Ambitious",24,123,"S",25.666666666666664]
["Ameera",20,79,"S",53.666666666666671]
["American Beauty",17,123,"D",53.117647058823529]
["American Pie",22,86,"S",44.060606060606062]
["Amethyst",17,93,"S",63.117647058823529]
["Amfortas",23,108,"D",33.565217391304344]
["Amigo",20,60,"S",60]
["Amulet",16,63,"S",79]
["Amy",23,101,"S",35.898550724637673]
["An Affair to Remember",20,101,"S",46.333333333333329]
["Anakin",15,88,"S",77.333333333333329]
["Ananda",15,76,"S",81.333333333333329]
["Anchor,",17,115,"S",55.784313725490208]
["Ancient Orange",17,87,"S",65.117647058823536]
["Andale",21,77,"S",50.523809523809526]
["Andrejana",25,69,"S",41]
["Angel",22,75,"S",47.727272727272727]
["Angel Eyes",24,92,"S",36]
["Angel of Mine",15,82,"S",79.333333333333329]
["Angelfire",19,96,"D",52.210526315789473]
["Angelina",16,75,"S",75]
["Angelo",24,84,"S",38.666666666666664]
["Angel's Glory",24,65,"S",45]
["Angle",19,63,"S",63.210526315789473]
["Anita",17,105,"D",59.117647058823529]
["Anna Bell",27,66,"S",37.25925925925926]
["Annabel",16,74,"S",75.333333333333329]
["Annabelle",19,82,"S",56.877192982456137]
["Annie",23,114,"S",31.565217391304348]
["Annie Oakley",20,77,"S",54.333333333333329]
["Ann's Misty Gal",25,111,"S",27]
["Another Chance",24,85,"S",38.333333333333329]
["Answered Prayers",19,79,"S",57.877192982456137]
["Anthem",25,85,"S",35.666666666666664]
["Anthony",22,66,"S",50.727272727272727]
["Anton",20,69,"S",57]
["Any Victory Will Do",22,72,"S",48.727272727272727]
["Anziyan",25,86,"S",35.333333333333336]
["Apache",20,90,"S",50]
["Apache Clouds",21,71,"S",52.523809523809526]
["Apache Outlaw",22,102,"D",38.727272727272727]
["Apache Sunrise",23,123,"D",28.565217391304348]
["Aphrodite",19,100,"S",50.877192982456137]
["Apollo",20,95,"S",48.333333333333329]
["Apollo's Chariot",22,98,"D",40.060606060606062]
["Appalooa",19,93,"S",53.210526315789473]
["Appichi",21,71,"S",52.523809523809526]
["Applause",22,76,"S",47.393939393939391]
["Apple",22,80,"S",46.060606060606062]
["Apple Butter",22,74,"S",48.060606060606062]
["Apple Candy",16,100,"D",66.666666666666657]
["Apple Dew",20,106,"D",44.666666666666671]
["Applejack",21,91,"S",45.857142857142854]
["AppleJacks",27,93,"D",28.25925925925926]
["Applejax",20,112,"D",42.666666666666671]
["Apples",21,79,"S",49.857142857142861]
["April",22,84,"S",44.727272727272727]
["April Babe",15,91,"S",76.333333333333329]
["April Showers",22,117,"D",33.727272727272727]
["Aqua",25,69,"S",41]
["Aquarius",20,84,"S",52]
["Arabella",19,60,"S",64.21052631578948]
["Arabian Dancer",22,66,"S",50.727272727272727]
["Arabian Knight",19,93,"D",53.210526315789473]
["Arabian Night",26,67,"S",39.205128205128204]
["Aragon",15,117,"D",67.666666666666671]
["Aramis",17,105,"D",59.117647058823529]
["Arbor ann",20,67,"S",57.666666666666657]
["Arcadia",18,61,"S",68.555555555555557]
["Archer",21,85,"S",47.857142857142861]
["Archie",16,95,"D",68.333333333333329]
["Archimedes",17,95,"D",62.450980392156865]
["Arctic Sun",26,115,"S",23.205128205128212]
["Areo",21,86,"S",47.523809523809526]
["Argo",21,80,"S",49.523809523809526]
["Ariadne",26,101,"D",27.871794871794869]
["Arial",20,99,"S",47]
["Aries",27,60,"S",39.25925925925926]
["Aristo",18,96,"S",56.888888888888886]
["Aristotle",22,68,"S",50.060606060606062]
["Arizona",19,91,"S",53.877192982456137]
["Arizona Sunset",25,88,"S",34.666666666666664]
["Armand",15,81,"S",79.666666666666657]
["Armed & Dangerous",27,66,"S",37.25925925925926]
["Armful of Tiger Lilies",19,89,"S",54.543859649122808]
["Arnica de la Barre",19,85,"S",55.877192982456137]
["Arnie",16,92,"S",69.333333333333329]
["Arrow",26,77,"S",35.871794871794869]
["Artemis",25,89,"S",34.333333333333336]
["Artex",21,110,"D",39.523809523809518]
["Arthur",22,103,"S",38.393939393939391]
["Artist",22,119,"D",33.060606060606062]
["Artoo",16,80,"S",73.333333333333329]
["As Good As it Gets",19,97,"D",51.877192982456137]
["Asgard",18,64,"S",67.555555555555557]
["Ash",26,87,"S",32.53846153846154]
["Ash Kalini",16,82,"S",72.666666666666671]
{"$rows_left_out":4565}
{"sheet":"the race","index":1,"n_rows":39,"n_cols":26,"rows_kept":39,"cut":false,"hidden":false,"merged":[[33,9,33,11],[34,9,35,11],[16,1,16,11],[17,1,17,11],[27,1,27,2],[15,1,15,11],[10,1,10,11],[11,1,11,11],[12,1,12,11],[13,1,13,11],[14,1,14,11]]}
["horse","stamina remaining","distance","strategy","speed","stamina","stamina cost","move next turn","new stamina","new distance",null,"new horses","race times","race over?",null,"expected time",null,null,null,null,null,null,null,"APPLIED AGAINST ODDS","min roll","AGAINST ODDS? "]
["Perfect Winter",0,400,{"$f":"VLOOKUP(A2,horses!A:D,4,FALSE)","v":"S"},{"$f":"VLOOKUP(A2,horses!A:D,2,FALSE)","v":19},{"$f":"VLOOKUP(A2,horses!A:D,3,FALSE)","v":85},{"$f":"IF(AND(D2=\"D\",C2<80),1,MIN(3,B2))","v":0},{"$f":"IF(G2=0,RANDBETWEEN(Y2,ROUNDUP(E2*0.25,0)),RANDBETWEEN(Y2,ROUNDUP(E2*G2/3,0)))","v":2},{"$f":"B2-G2","v":0},{"$f":"MIN(400,C2+H2+IF(X2=1,ROUNDUP(SQRT(B20),0),0))","v":400},null,{"$f":"INDIRECT(ADDRESS(RANDBETWEEN(2,horses!$G$19),1,1,1,\"horses\"),TRUE)","v":"Pheonix"},79.8,{"$f":"IF(COUNTIF(M2:M9,\">0\")=8,1,0)","v":1},null,{"$f":"VLOOKUP(A2,horses!A:E,5,FALSE)","v":55.877192982456137},null,{"$f":"STANDARDIZE(P2,$P$11,$P$12)","v":0.40213183124634189},{"$f":"NORMSDIST(R2)","v":0.65620649616756765},{"$f":"1-S2","v":0.34379350383243235},{"$f":"T2/SUM($T$2:$T$9)","v":8.4849338096551624E-2},{"$f":"ROUNDUP(1/U2,0)","v":12},{"$f":"ROUNDUP(2*V2/MIN($V$2:$V$9),0)+X2","v":5},0,{"$f":"IF(B20>25,4,IF(B20>10,3,1))","v":1},{"$f":"IF(RAND()<1/B20,1,0)","v":0}]
["Foxy",0,400,{"$f":"VLOOKUP(A3,horses!A:D,4,FALSE)","v":"D"},{"$f":"VLOOKUP(A3,horses!A:D,2,FALSE)","v":21},{"$f":"VLOOKUP(A3,horses!A:D,3,FALSE)","v":95},0,{"$f":"IF(G3=0,RANDBETWEEN(Y3,ROUNDUP(E3*0.25,0)),RANDBETWEEN(Y3,ROUNDUP(E3*G3/3,0)))","v":1},{"$f":"B3-G3","v":0},{"$f":"MIN(400,C3+H3+IF(X3=1,ROUNDUP(SQRT(B21),0),0))","v":400},null,{"$f":"INDIRECT(ADDRESS(RANDBETWEEN(2,horses!$G$19),1,1,1,\"horses\"),TRUE)","v":"Zorro Garlic"},58,null,null,{"$f":"VLOOKUP(A3,horses!A:E,5,FALSE)","v":44.523809523809526},null,{"$f":"STANDARDIZE(P3,$P$11,$P$12)","v":-0.27478214331229539},{"$f":"NORMSDIST(R3)","v":0.39174180889157584},{"$f":"1-S3","v":0.60825819110842416},{"$f":"T3/SUM($T$2:$T$9)","v":0.15012007013521367},{"$f":"ROUNDUP(1/U3,0)","v":7},{"$f":"ROUNDUP(2*V3/MIN($V$2:$V$9),0)+X3","v":3},0,{"$f":"IF(B21>25,4,IF(B21>10,3,1))","v":1},{"$f":"IF(RAND()<1/B21,1,0)","v":0}]
["Arial",0,400,{"$f":"VLOOKUP(A4,horses!A:D,4,FALSE)","v":"S"},{"$f":"VLOOKUP(A4,horses!A:D,2,FALSE)","v":20},{"$f":"VLOOKUP(A4,horses!A:D,3,FALSE)","v":99},0,2,0,400,null,{"$f":"INDIRECT(ADDRESS(RANDBETWEEN(2,horses!$G$19),1,1,1,\"horses\"),TRUE)","v":"Sneak Preview"},31.09090909090909,null,null,{"$f":"VLOOKUP(A4,horses!A:E,5,FALSE)","v":47},null,-0.12714615945712243,0.44941235896818515,0.5505876410318149,0.13588679362732081,8,5,1,1,0]
["Beach",0,399,{"$f":"VLOOKUP(A5,horses!A:D,4,FALSE)","v":"S"},{"$f":"VLOOKUP(A5,horses!A:D,2,FALSE)","v":18},{"$f":"VLOOKUP(A5,horses!A:D,3,FALSE)","v":70},0,1,0,400,null,{"$f":"INDIRECT(ADDRESS(RANDBETWEEN(2,horses!$G$19),1,1,1,\"horses\"),TRUE)","v":"Adrian"},83.6,null,null,{"$f":"VLOOKUP(A5,horses!A:E,5,FALSE)","v":65.555555555555557},null,0.97917733494478343,0.83625381728279935,0.16374618271720065,4.0413082459415529E-2,25,10,0,1,0]
["Miscief",0,400,{"$f":"VLOOKUP(A6,horses!A:D,4,FALSE)","v":"S"},{"$f":"VLOOKUP(A6,horses!A:D,2,FALSE)","v":25},{"$f":"VLOOKUP(A6,horses!A:D,3,FALSE)","v":78},0,2,0,400,null,{"$f":"INDIRECT(ADDRESS(RANDBETWEEN(2,horses!$G$19),1,1,1,\"horses\"),TRUE)","v":"Shizsaad"},24.3,null,null,{"$f":"VLOOKUP(A6,horses!A:E,5,FALSE)","v":38},null,{"$f":"STANDARDIZE(P6,$P$11,$P$12)","v":-0.66374617769996291},0.25342638940196649,0.74657361059803351,0.18425675876200179,6,4,1,1,0]
["Text",0,400,{"$f":"VLOOKUP(A7,horses!A:D,4,FALSE)","v":"S"},{"$f":"VLOOKUP(A7,horses!A:D,2,FALSE)","v":23},{"$f":"VLOOKUP(A7,horses!A:D,3,FALSE)","v":80},0,3,0,400,null,{"$f":"INDIRECT(ADDRESS(RANDBETWEEN(2,horses!$G$19),1,1,1,\"horses\"),TRUE)","v":"Daddy's Overdraft"},30.5,null,null,{"$f":"VLOOKUP(A7,horses!A:E,5,FALSE)","v":42.89855072463768},null,-0.37168368789951201,0.35506418573667381,0.64493581426332613,0.15917222502748599,7,4,1,1,1]
["Tronto",0,400,{"$f":"VLOOKUP(A8,horses!A:D,4,FALSE)","v":"S"},{"$f":"VLOOKUP(A8,horses!A:D,2,FALSE)","v":15},{"$f":"VLOOKUP(A8,horses!A:D,3,FALSE)","v":90},0,4,0,400,null,{"$f":"INDIRECT(ADDRESS(RANDBETWEEN(2,horses!$G$19),1,1,1,\"horses\"),TRUE)","v":"Look At me Go"},64.5,null,null,{"$f":"VLOOKUP(A8,horses!A:E,5,FALSE)","v":76.666666666666657},null,1.6416464932692771,0.94966835679782369,5.0331643202176313E-2,1.2422010780919205E-2,81,33,0,4,0]
["Avenger",0,400,{"$f":"VLOOKUP(A9,horses!A:D,4,FALSE)","v":"D"},{"$f":"VLOOKUP(A9,horses!A:D,2,FALSE)","v":26},{"$f":"VLOOKUP(A9,horses!A:D,3,FALSE)","v":117},0,3,0,400,null,{"$f":"INDIRECT(ADDRESS(RANDBETWEEN(2,horses!$G$19),1,1,1,\"horses\"),TRUE)","v":"Cavier"},29.92,null,null,{"$f":"VLOOKUP(A9,horses!A:E,5,FALSE)","v":22.53846153846154},null,-1.5855974910915094,5.6415322872676567E-2,0.94358467712732341,0.2328797211110914,5,3,1,1,1]
[]
[{"$f":"A2","v":"Perfect Winter"},{"$f":"C2","v":400},null,null,null,null,null,null,null,null,null,null,null,null,null,{"$f":"AVERAGE(P2:P9)","v":49.132529623948386}]
[{"$f":"A3","v":"Foxy"},{"$f":"C3","v":400},null,null,null,null,null,null,null,null,null,null,null,null,null,{"$f":"STDEV(P2:P9)","v":16.772269276977575}]
["Arial",400]
["Beach",399]
["Miscief",400]
["Text",400]
["Tronto",400]
["Avenger",400]
["BETS","Odds","Time","Position"]
[{"$f":"A11","v":"Perfect Winter"},{"$f":"W2","v":5},{"$f":"M2","v":79.8},{"$f":"RANK(C20,$C$20:$C$27,1)","v":7}]
[{"$f":"A12","v":"Foxy"},{"$f":"W3","v":3},{"$f":"M3","v":58},{"$f":"RANK(C21,$C$20:$C$27,1)","v":5}]
["Arial",5,31.09090909090909,4]
["Beach",10,83.6,8]
["Miscief",4,24.3,1]
["Text",4,30.5,3]
["Tronto",33,64.5,6]
["Avenger",3,29.92,2]
[null,"Payout",null,{"$f":"D20*$A$29*$B$20+D21*$A$30*$B$21+D22*$A$31*$B$22+D23*$A$32*$B$23+D24*$A$33*$B$24+D25*$A$34*$B$25+D26*$A$35*$B$26+D27*$A$36*$B$27","v":11},{"$f":"E20*$A$29*$B$20+E21*$A$30*$B$21+E22*$A$31*$B$22+E23*$A$32*$B$23+E24*$A$33*$B$24+E25*$A$34*$B$25+E26*$A$35*$B$26+E27*$A$36*$B$27","v":0},0,0,0,0,0,0,0,0,0,0,0]
[{"$f":"IF(RANK(C20,$C$20:$C$27,1)=1,1,IF(RANK(C20,$C$20:$C$27,1)=2,0.5,IF(RANK(C20,$C$20:$C$27,1)=3,1/3,0)))","v":0},null,null,"*1st place: full payout; 2nd place: 1/2 payout; 3rd place: 1/3 payout"]
[0]
[0]
[0]
[1]
[0.33333333333333331,null,null,null,null,"Speed",0.1]
[0,null,null,null,null,null,null,null,null,"Enter name in box above then press button"]
[0.5]
[null,null,"Player",null,{"$f":"IF(E19=0,\"\",E19)","v":""},"","","","","","","","","","",""]
[null,null,"Cash",null,{"$f":"IFERROR(VLOOKUP(E37,players!$A:$D,2,FALSE),\"\")","v":""},{"$f":"IFERROR(VLOOKUP(F37,players!$A:$D,2,FALSE),\"\")","v":""},{"$f":"IFERROR(VLOOKUP(G37,players!$A:$D,2,FALSE),\"\")","v":""},{"$f":"IFERROR(VLOOKUP(H37,players!$A:$D,2,FALSE),\"\")","v":""},{"$f":"IFERROR(VLOOKUP(I37,players!$A:$D,2,FALSE),\"\")","v":""},{"$f":"IFERROR(VLOOKUP(J37,players!$A:$D,2,FALSE),\"\")","v":""},{"$f":"IFERROR(VLOOKUP(K37,players!$A:$D,2,FALSE),\"\")","v":""},{"$f":"IFERROR(VLOOKUP(L37,players!$A:$D,2,FALSE),\"\")","v":""},{"$f":"IFERROR(VLOOKUP(M37,players!$A:$D,2,FALSE),\"\")","v":""},{"$f":"IFERROR(VLOOKUP(N37,players!$A:$D,2,FALSE),\"\")","v":""},{"$f":"IFERROR(VLOOKUP(O37,players!$A:$D,2,FALSE),\"\")","v":""},{"$f":"IFERROR(VLOOKUP(P37,players!$A:$D,2,FALSE),\"\")","v":""}]
[null,null,"Average Winnings",null,{"$f":"IFERROR(VLOOKUP(E19,players!$A:$D,4,FALSE),\"\")","v":""},{"$f":"IFERROR(VLOOKUP(F19,players!$A:$D,4,FALSE),\"\")","v":""},{"$f":"IFERROR(VLOOKUP(G19,players!$A:$D,4,FALSE),\"\")","v":""},{"$f":"IFERROR(VLOOKUP(H19,players!$A:$D,4,FALSE),\"\")","v":""},{"$f":"IFERROR(VLOOKUP(I19,players!$A:$D,4,FALSE),\"\")","v":""},{"$f":"IFERROR(VLOOKUP(J19,players!$A:$D,4,FALSE),\"\")","v":""},{"$f":"IFERROR(VLOOKUP(K19,players!$A:$D,4,FALSE),\"\")","v":""},{"$f":"IFERROR(VLOOKUP(L19,players!$A:$D,4,FALSE),\"\")","v":""},{"$f":"IFERROR(VLOOKUP(M19,players!$A:$D,4,FALSE),\"\")","v":""},{"$f":"IFERROR(VLOOKUP(N19,players!$A:$D,4,FALSE),\"\")","v":""},{"$f":"IFERROR(VLOOKUP(O19,players!$A:$D,4,FALSE),\"\")","v":""},{"$f":"IFERROR(VLOOKUP(P19,players!$A:$D,4,FALSE),\"\")","v":""}]

{"sheet":"players","index":2,"n_rows":3,"n_cols":7,"rows_kept":3,"cut":false,"hidden":true,"merged":[]}
["Player","Cash","Number of Bets","Average Winnings",null,"Cash","Number of Bets"]
["TEMPLATE",1000,0,{"$f":"IFERROR((B2-1000)/C2,0)","v":0},null,{"$f":"B2+IFERROR(HLOOKUP(A2,'the race'!$D$19:$P$28,10,FALSE),0)-SUM(INDIRECT(ADDRESS(20,IFERROR(MATCH(A2,'the race'!$A$19:$P$19,0),1),1,1,\"the race\")&\":\"&ADDRESS(27,IFERROR(MATCH(A2,'the race'!$A$19:$P$19,0),1),1,1),TRUE))","v":1000},{"$f":"C2+IF(COUNTIF('the race'!$D$19:$P$19,players!A2)>0,1,0)","v":0}]
["TEMPLATE",1000,0,{"$f":"IFERROR((B3-1000)/C3,0)","v":0},null,{"$f":"B3+IFERROR(HLOOKUP(A3,'the race'!$D$19:$P$28,10,FALSE),0)-SUM(INDIRECT(ADDRESS(20,IFERROR(MATCH(A3,'the race'!$A$19:$P$19,0),1),1,1,\"the race\")&\":\"&ADDRESS(27,IFERROR(MATCH(A3,'the race'!$A$19:$P$19,0),1),1,1),TRUE))","v":1000},{"$f":"C3+IF(COUNTIF('the race'!$D$19:$P$19,players!A3)>0,1,0)","v":0}]