{"text_format":"1","workbook":"xlsx","n_sheets":3,"sheets":["horses","the race","players"],"not_rendered":{"charts":0,"images":10,"macros":1,"external_links":0,"defined_names":1,"comments":0,"pivot_tables":0},"unopened":[],"bounds":{"document_bytes":16777216,"sheet_cells":100000,"rows_first":2000,"rows_last":500,"rows_between":2000,"halvings":0,"cell_chars":16384,"cell_head_chars":4096},"cells_cut":0,"cells_raw":0,"read":"whole","date_system":"1900"}

{"sheet":"horses","index":0,"n_rows":4764,"n_cols":10,"rows_kept":4764,"cut":false,"hidden":true,"merged":[]}
["HORSE","SPEED (fastest horses get up to about 20 meters / second)","STAMINA","STRATEGY","estimated finish time",null,"for distance: uses 1 stamina per turn but max speed is 1/3. at .2 race completion, uses 3 stamina per turn at max speed until run out of stamina then goes to 1/4 speed"]
["D.J.",22,72,"S",48.727272727272727,null,"for sprinter: from start uses 3 stamina per turn at max speed and goes to 1/4 speed when runs out of stamina"]
["Abaccus",20,83,"S",52.333333333333329,null,"each turn: move distance equal to random between (1,speed)"]
["Abbervail Dream",26,91,"S",31.205128205128208,null,"distance of races:"]
["Abby",25,70,"S",40.666666666666657,null,"quarter race: 400 m ",null,"*we will only use this race type"]
["Abdullah",21,76,"S",50.857142857142861,null,"pleasure ride endurance race: 16000 m"]
["Abercrombie",15,90,"S",76.666666666666657,null,"non-competitive trail race: 40000 m"]
["Able Master",18,96,"S",56.888888888888886,null,"competitive trail race: 64000 m"]
["Above and Beyond",27,71,"S",35.592592592592595,null,"endurace race: 100000 m"]
["Above The Clouds",26,108,"S",25.53846153846154]
["Abracadabra",16,77,"S",74.333333333333329,null,{"$f":"MIN(B:B)","v":10},{"$f":"MIN(C:C)","v":40},{"$f":"COUNTIF(D:D,\"S\")","v":3609},{"$f":"MIN(E:E)","v":13.809523809523817}]
["Absent",17,96,"S",62.117647058823529,null,{"$f":"MAX(B:B)","v":28},{"$f":"MAX(C:C)","v":130},{"$f":"COUNTA(D:D)-1","v":4763},{"$f":"MAX(E:E)","v":146.66666666666666}]
["Absolute Bullet Proof",27,92,"D",28.592592592592595,null,{"$f":"AVERAGE(B:B)","v":20.791307999160193},{"$f":"AVERAGE(C:C)","v":87.991601931555749},{"$f":"I11/I12","v":0.7577157253831619},{"$f":"AVERAGE(E:E)","v":49.657475646431848}]
["Abu",19,109,"D",47.877192982456137,null,null,null,"S"]
["Acapella",20,69,"S",57]
["Ace",15,98,"D",74]
["Ace of Spades",18,92,"D",58.222222222222229]
["Acer",19,89,"S",54.543859649122808,null,"NUMBER:"]
["Aces Diamond Rio",22,67,"S",50.393939393939391,null,4763]
["Acker Bilk",21,79,"S",49.857142857142861]
["Acorn",22,80,"S",46.060606060606062]
["Acromantula",26,99,"D",28.53846153846154]
["Ad Alta",16,100,"D",66.666666666666657]
["Adagio",27,92,"D",28.592592592592595]
["Adat",18,116,"D",50.222222222222221]
["Addie Over",21,78,"S",50.19047619047619]
["Admiral",25,105,"D",29]
["Adrian",27,62,"S",38.592592592592595]
["Aeris",22,119,"D",33.060606060606062]
["Aerosmith",19,83,"S",56.543859649122808]
["Aferditie",16,113,"D",62.333333333333336]
["Africa",26,93,"S",30.53846153846154]
["Afterglow",19,95,"D",52.543859649122808]
["Afternoon Delight",27,92,"D",28.592592592592595]
["Aftershock",19,121,"D",43.877192982456137]
["Agape",15,87,"S",77.666666666666657]
["Agent 007",15,71,"S",83]
["Aggie's Diamond",21,84,"S",48.19047619047619]
["Ahlerich",27,92,"D",28.592592592592595]
["Ahwa",26,69,"S",38.53846153846154]
["Ai",22,74,"S",48.060606060606062]
["Aida",27,91,"S",28.925925925925924]
["Aidan",16,106,"D",64.666666666666657]
["Aiko",27,89,"S",29.592592592592595]
["Ain't Misbehavin",19,90,"S",54.210526315789473]
["Air",21,83,"S",48.523809523809526]
["Air Born",19,99,"D",51.210526315789473]
["Air Express",20,64,"S",58.666666666666657]
["Airborne Magic",16,75,"S",75]
["Aitch",17,84,"S",66.117647058823536]
["Akasha",23,81,"S",42.565217391304344]
["Akhademy",24,99,"D",33.666666666666664]
["Al",21,61,"S",55.857142857142861]
["Al Akbar",20,102,"D",46]
["Alacazam",22,75,"S",47.727272727272727]
["Aladdin",19,85,"S",55.877192982456137]
["Alanah",18,100,"D",55.555555555555557]
["Alaska",15,75,"S",81.666666666666657]
["Alberton Star",22,98,"D",40.060606060606062]
["Alcatraz",27,72,"S",35.25925925925926]
["Alex",20,84,"S",52]
["Alexa",19,119,"D",44.543859649122808]
["Alexander the Great",25,100,"S",30.666666666666664]
["Alfie",21,116,"S",37.523809523809518]
["Ali",17,63,"S",73.117647058823536]
["Ali Baba",26,96,"D",29.53846153846154]
["Alia Kazam",27,89,"S",29.592592592592595]
["Alizay",21,87,"S",47.19047619047619]
["All My Heart",21,99,"S",43.19047619047619]
["All Natural",17,87,"S",65.117647058823536]
["All that Jazz",16,80,"S",73.333333333333329]
["Alladin's Treasure",22,70,"S",49.393939393939391]
["All-American Rocket",19,123,"D",43.210526315789473]
["Allegra",21,82,"S",48.857142857142861]
["Allegria",18,95,"S",57.222222222222229]
["Allegro",25,73,"S",39.666666666666664]
["Allison Fast",21,85,"S",47.857142857142861]
["Allouette",19,102,"S",50.210526315789473]
["Alloverdaplace",22,101,"D",39.060606060606062]
["Allstar",20,88,"S",50.666666666666671]
["Ally",18,98,"D",56.222222222222221]
["Almonds",16,76,"S",74.666666666666671]
["Almost Illegal",22,93,"D",41.727272727272727]
["Alomar",19,94,"D",52.877192982456137]
["Alotastuff",26,92,"D",30.871794871794869]
["Alouette",20,72,"S",56]
["Altair",15,74,"S",82]
["Altivo",19,97,"S",51.877192982456137]
["Alto Vito",19,59,"S",64.543859649122808]
["Always",24,84,"S",38.666666666666664]
["Always A Dot",22,100,"D",39.393939393939391]
["Amadeus",20,87,"S",51]
["Amanda",15,90,"S",76.666666666666657]
["Amaretto",17,90,"S",64.117647058823536]
["Amarillo Rose",16,113,"D",62.333333333333336]
["Amazing",20,68,"S",57.333333333333343]
["Amazing Grace",19,101,"S",50.543859649122808]
["Amazon",27,105,"S",24.25925925925926]
["Ambara",19,123,"D",43.210526315789473]
["Ambassador",21,99,"D",43.19047619047619]
["Amber",17,110,"D",57.450980392156858]
["Amber Dancer",20,74,"S",55.333333333333336]
["Ambition",17,85,"S",65.784313725490193]
["Ambitious",24,123,"S",25.666666666666664]
["Ameera",20,79,"S",53.666666666666671]
["American Beauty",17,123,"D",53.117647058823529]
["American Pie",22,86,"S",44.060606060606062]
["Amethyst",17,93,"S",63.117647058823529]
["Amfortas",23,108,"D",33.565217391304344]
["Amigo",20,60,"S",60]
["Amulet",16,63,"S",79]
["Amy",23,101,"S",35.898550724637673]
["An Affair to Remember",20,101,"S",46.333333333333329]
["Anakin",15,88,"S",77.333333333333329]
["Ananda",15,76,"S",81.333333333333329]
["Anchor,",17,115,"S",55.784313725490208]
["Ancient Orange",17,87,"S",65.117647058823536]
["Andale",21,77,"S",50.523809523809526]
["Andrejana",25,69,"S",41]
["Angel",22,75,"S",47.727272727272727]
["Angel Eyes",24,92,"S",36]
["Angel of Mine",15,82,"S",79.333333333333329]
["Angelfire",19,96,"D",52.210526315789473]
["Angelina",16,75,"S",75]
["Angelo",24,84,"S",38.666666666666664]
["Angel's Glory",24,65,"S",45]
["Angle",19,63,"S",63.210526315789473]
["Anita",17,105,"D",59.117647058823529]
["Anna Bell",27,66,"S",37.25925925925926]
["Annabel",16,74,"S",75.333333333333329]
["Annabelle",19,82,"S",56.877192982456137]
["Annie",23,114,"S",31.565217391304348]
["Annie Oakley",20,77,"S",54.333333333333329]
["Ann's Misty Gal",25,111,"S",27]
["Another Chance",24,85,"S",38.333333333333329]
["Answered Prayers",19,79,"S",57.877192982456137]
["Anthem",25,85,"S",35.666666666666664]
["Anthony",22,66,"S",50.727272727272727]
["Anton",20,69,"S",57]
["Any Victory Will Do",22,72,"S",48.727272727272727]
["Anziyan",25,86,"S",35.333333333333336]
["Apache",20,90,"S",50]
["Apache Clouds",21,71,"S",52.523809523809526]
["Apache Outlaw",22,102,"D",38.727272727272727]
["Apache Sunrise",23,123,"D",28.565217391304348]
["Aphrodite",19,100,"S",50.877192982456137]
["Apollo",20,95,"S",48.333333333333329]
["Apollo's Chariot",22,98,"D",40.060606060606062]
["Appalooa",19,93,"S",53.210526315789473]
["Appichi",21,71,"S",52.523809523809526]
["Applause",22,76,"S",47.393939393939391]
["Apple",22,80,"S",46.060606060606062]
["Apple Butter",22,74,"S",48.060606060606062]
["Apple Candy",16,100,"D",66.666666666666657]
["Apple Dew",20,106,"D",44.666666666666671]
["Applejack",21,91,"S",45.857142857142854]
["AppleJacks",27,93,"D",28.25925925925926]
["Applejax",20,112,"D",42.666666666666671]
["Apples",21,79,"S",49.857142857142861]
["April",22,84,"S",44.727272727272727]
["April Babe",15,91,"S",76.333333333333329]
["April Showers",22,117,"D",33.727272727272727]
["Aqua",25,69,"S",41]
["Aquarius",20,84,"S",52]
["Arabella",19,60,"S",64.21052631578948]
["Arabian Dancer",22,66,"S",50.727272727272727]
["Arabian Knight",19,93,"D",53.210526315789473]
["Arabian Night",26,67,"S",39.205128205128204]
["Aragon",15,117,"D",67.666666666666671]
["Aramis",17,105,"D",59.117647058823529]
["Arbor ann",20,67,"S",57.666666666666657]
["Arcadia",18,61,"S",68.555555555555557]
["Archer",21,85,"S",47.857142857142861]
["Archie",16,95,"D",68.333333333333329]
["Archimedes",17,95,"D",62.450980392156865]
["Arctic Sun",26,115,"S",23.205128205128212]
["Areo",21,86,"S",47.523809523809526]
["Argo",21,80,"S",49.523809523809526]
["Ariadne",26,101,"D",27.871794871794869]
["Arial",20,99,"S",47]
["Aries",27,60,"S",39.25925925925926]
["Aristo",18,96,"S",56.888888888888886]
["Aristotle",22,68,"S",50.060606060606062]
["Arizona",19,91,"S",53.877192982456137]
["Arizona Sunset",25,88,"S",34.666666666666664]
["Armand",15,81,"S",79.666666666666657]
["Armed & Dangerous",27,66,"S",37.25925925925926]
["Armful of Tiger Lilies",19,89,"S",54.543859649122808]
["Arnica de la Barre",19,85,"S",55.877192982456137]
["Arnie",16,92,"S",69.333333333333329]
["Arrow",26,77,"S",35.871794871794869]
["Artemis",25,89,"S",34.333333333333336]
["Artex",21,110,"D",39.523809523809518]
["Arthur",22,103,"S",38.393939393939391]
["Artist",22,119,"D",33.060606060606062]
["Artoo",16,80,"S",73.333333333333329]
["As Good As it Gets",19,97,"D",51.877192982456137]
["Asgard",18,64,"S",67.555555555555557]
["Ash",26,87,"S",32.53846153846154]
["Ash Kalini",16,82,"S",72.666666666666671]
["Ash Winder",26,98,"D",28.871794871794865]
["Ashanti",19,100,"S",50.877192982456137]
["Ashes",19,82,"S",56.877192982456137]
["Ashka",24,93,"D",35.666666666666664]
["Ashleigh",21,104,"D",41.523809523809518]
["Ashley",19,70,"S",60.877192982456137]
["Asia",23,59,"S",49.898550724637687]
["Aspects of Love",20,112,"S",42.666666666666671]
["Aspen",15,66,"S",84.666666666666657]
["Assistance",20,60,"S",60]
["Astro Boy",21,75,"S",51.19047619047619]
["Astrology",20,104,"D",45.333333333333329]
["At Last",18,79,"S",62.555555555555557]
["Athena",19,98,"S",51.543859649122808]
["Athos",19,75,"S",59.210526315789473]
["Atkins Gold",24,115,"D",28.333333333333336]
["Atlanta",27,66,"S",37.25925925925926]
["Atom",20,82,"S",52.666666666666671]
["Au Lait",19,70,"S",60.877192982456137]
["Audrey",21,97,"S",43.857142857142861]
["Aurel",19,122,"S",43.543859649122808]
["Aurora",21,93,"S",45.19047619047619]
["Austin",21,78,"S",50.19047619047619]
["Auto Rotate",19,93,"S",53.210526315789473]
["Autum",19,97,"D",51.877192982456137]
["Autumn Gold",19,60,"S",64.21052631578948]
["Autumn Rein",17,99,"S",61.117647058823529]
["Autumn Spirit",19,108,"D",48.210526315789473]
["Autumn Star",20,98,"D",47.333333333333329]
["Autumn Storm",20,94,"S",48.666666666666671]
["Ava",20,93,"D",49]
["Avasha",20,102,"D",46]
["Avenida",20,117,"D",41]
["Averti",21,79,"S",49.857142857142861]
["Aviance",22,118,"D",33.393939393939391]
["Avril",24,91,"S",36.333333333333329]
["Awesome Wild One",27,68,"S",36.592592592592595]
["Ayla",16,85,"S",71.666666666666671]
["Ayr Tyme",17,106,"S",58.784313725490208]
["Azbo",27,75,"S",34.25925925925926]
["Azi Makasi",24,67,"S",44.333333333333329]
["Aznavour",23,78,"S",43.565217391304344]
["Aztec",15,74,"S",82]
["Azur",22,109,"D",36.393939393939391]
["Azure",16,111,"D",63]
["B.C.",22,73,"S",48.393939393939391]
["Babauska",26,83,"S",33.871794871794869]
["Babbelute",15,85,"S",78.333333333333329]
["Babe",27,85,"S",30.925925925925924]
["Babe Ruth",18,69,"S",65.888888888888886]
["Babes",19,88,"S",54.877192982456137]
["Baby Blue",21,89,"S",46.523809523809526]
["Baby Boom",17,75,"S",69.117647058823536]
["Baby Doll",23,101,"S",35.898550724637673]
["Baby Faith",21,115,"S",37.857142857142861]
["Baby G",20,80,"S",53.333333333333329]
["Baby Mae Bars",18,113,"D",51.222222222222221]
["Baby Moon",26,101,"D",27.871794871794869]
["Babycakes",27,85,"S",30.925925925925924]
["Babycham",27,86,"S",30.592592592592595]
["Bacardi",24,96,"D",34.666666666666664]
["Back In A Flash",21,105,"D",41.19047619047619]
["Backstreet Bay",16,85,"S",71.666666666666671]
["Bad Time",25,64,"S",42.666666666666657]
["Bad Whisky",26,93,"S",30.53846153846154]
["Badge",22,109,"D",36.393939393939391]
["Badger",20,83,"S",52.333333333333329]
["Bagels",24,78,"S",40.666666666666664]
["Bail Me Out",18,89,"S",59.222222222222229]
["Bailey",16,88,"S",70.666666666666671]
["Baileys Irish Cream",17,77,"S",68.450980392156865]
["Balancing Belle",20,75,"S",55]
["Baldemar",24,61,"S",46.333333333333329]
["Baldy",24,106,"S",31.333333333333336]
["Ball Park",15,88,"S",77.333333333333329]
["Ballet",25,110,"D",27.333333333333336]
["Baloo",20,81,"S",53]
["Bama",19,71,"S",60.543859649122808]
["Bam-Bam",15,60,"S",86.666666666666671]
["Bambi",22,86,"S",44.060606060606062]
["Bambino",23,73,"S",45.231884057971016]
["Bammer",20,62,"S",59.333333333333343]
["Bandana",20,81,"S",53]
["Bandido",19,79,"S",57.877192982456137]
["Bandit",15,93,"S",75.666666666666657]
["Banjo",17,102,"D",60.117647058823529]
["Banner",23,69,"S",46.565217391304344]
["Banner Blossom",19,87,"S",55.210526315789473]
["Bar King",20,70,"S",56.666666666666657]
["Bar Mount",27,100,"S",25.925925925925927]
["Bar Room",19,79,"S",57.877192982456137]
["Barbie",26,121,"S",21.205128205128201]
["Bare Necessities",23,60,"S",49.565217391304344]
["Baringr",16,96,"D",68]
["Bar-K Truffles",23,79,"S",43.231884057971016]
["Barkley",27,112,"S",21.925925925925931]
["Barleda",19,81,"S",57.210526315789473]
["Barney",27,71,"S",35.592592592592595]
["Barnum",22,70,"S",49.393939393939391]
["Baron",22,101,"D",39.060606060606062]
["Barq",26,107,"D",25.871794871794869]
["Barreness",27,116,"S",20.592592592592592]
["Barron",22,71,"S",49.060606060606062]
["Bart",22,98,"D",40.060606060606062]
["Baryshnikov",20,78,"S",54]
["Barzanadana",22,110,"S",36.060606060606062]
["Basha",25,96,"D",32]
["Bashful",21,67,"S",53.857142857142861]
["Basil",17,79,"S",67.784313725490193]
["Basilas",22,93,"D",41.727272727272727]
["Bask",22,84,"S",44.727272727272727]
["Bassenthwaite",20,91,"S",49.666666666666671]
["Bastiaan",25,71,"S",40.333333333333343]
["Bathsheba",22,81,"S",45.727272727272727]
["Batman",21,99,"D",43.19047619047619]
["Batman",22,79,"S",46.393939393939391]
["Batovian",20,72,"S",56]
["Batteries Not Included",17,77,"S",68.450980392156865]
["Battlecry",21,113,"S",38.523809523809518]
["Batty",15,66,"S",84.666666666666657]
["Baxter",19,73,"S",59.877192982456137]
["Bay",26,102,"S",27.53846153846154]
["Bay Petite",19,99,"S",51.210526315789473]
["Bayard",27,80,"S",32.592592592592595]
["Bayjour",22,94,"S",41.393939393939391]
["Baymont",25,93,"S",33]
["Baystreet",20,87,"S",51]
["Baywatch Babe",26,72,"S",37.53846153846154]
["Bazooka",24,109,"S",30.333333333333336]
["BBQ",15,80,"S",80]
["Be My Guest",27,92,"S",28.592592592592595]
["Be My Valentine",20,79,"S",53.666666666666671]
["Beach",18,70,"S",65.555555555555557]
["Beach Game",24,69,"S",43.666666666666671]
["Beachcomber",27,84,"S",31.25925925925926]
["Beam Me Up Scottie",18,111,"S",51.888888888888886]
["Beaming",15,76,"S",81.333333333333329]
["Bear",17,73,"S",69.784313725490193]
["Beat the Clock",20,67,"S",57.666666666666657]
["Beau",22,66,"S",50.727272727272727]
["Beau Dancer",16,114,"S",62]
["Beau Zam",18,100,"S",55.555555555555557]
["Beau Zephyr",20,119,"D",40.333333333333329]
["Beautiful Dreamer",21,99,"D",43.19047619047619]
["Beautiful Oblivian",15,93,"D",75.666666666666657]
["Beauty",23,91,"S",39.231884057971016]
["Beauty's Star",24,84,"S",38.666666666666664]
["Beaver",27,69,"S",36.25925925925926]
["Beck",20,101,"D",46.333333333333329]
["Bedazzaled",23,74,"S",44.89855072463768]
["Beech Sky",21,117,"S",37.19047619047619]
["Beezely",21,97,"S",43.857142857142861]
["Beigh",20,119,"S",40.333333333333329]
["Bekki",27,76,"S",33.925925925925924]
["Believe",16,77,"S",74.333333333333329]
["Believe n Miracles",19,118,"S",44.877192982456137]
["Bell",27,69,"S",36.25925925925926]
["Bella",17,75,"S",69.117647058823536]
["Bella Baby",17,68,"S",71.450980392156865]
["Belladonte",25,86,"S",35.333333333333336]
["Belle",22,77,"S",47.060606060606062]
["Belle of the Ball",20,97,"D",47.666666666666671]
["Bellefire",21,70,"S",52.857142857142861]
["Belleza",25,92,"S",33.333333333333336]
["Bellini",15,67,"S",84.333333333333329]
["Bellino",24,121,"S",26.333333333333336]
["Bellota's Jewel",23,80,"S",42.89855072463768]
["Belltello",23,89,"S",39.89855072463768]
["Belmont",22,75,"S",47.727272727272727]
["Ben",27,83,"S",31.592592592592595]
["Benjamin",23,76,"S",44.231884057971016]
["Benny",19,67,"S",61.877192982456137]
["Benny Boy",23,77,"S",43.89855072463768]
["Benson",18,72,"S",64.888888888888886]
["Bento",22,90,"S",42.727272727272727]
["Bermuda",15,93,"S",75.666666666666657]
["Berry",20,123,"D",39]
["Berry Blitz",15,80,"S",80]
["Bert",20,63,"S",59]
["Best Bet",22,105,"D",37.727272727272727]
["Best of Luck",21,85,"S",47.857142857142861]
["Betty",17,65,"S",72.450980392156865]
["Beyond the Limits",18,120,"D",48.888888888888886]
["Bianca",20,73,"S",55.666666666666664]
["Big Ben",22,75,"S",47.727272727272727]
["Big Bert",25,94,"D",32.666666666666664]
["Big Bird",19,99,"D",51.210526315789473]
["Big Foot",25,77,"S",38.333333333333336]
["Big Hustler",20,109,"S",43.666666666666671]
["Big Jake",24,65,"S",45]
["Big League",15,65,"S",85]
["Big Mac",23,73,"S",45.231884057971016]
["Big News",23,73,"S",45.231884057971016]
["Big Red",21,79,"S",49.857142857142861]
["Big'n",18,61,"S",68.555555555555557]
["Bigstone",25,69,"S",41]
["Bijoux",21,70,"S",52.857142857142861]
["Bikini",19,79,"S",57.877192982456137]
["Bilbo",21,93,"S",45.19047619047619]
["Billie",16,99,"D",67]
["Billy",21,62,"S",55.523809523809518]
["Billy the Kid",22,103,"D",38.393939393939391]
["Bindi",17,117,"D",55.117647058823529]
["Bindy",19,98,"S",51.543859649122808]
["Bingo",19,108,"D",48.210526315789473]
["Bio",18,100,"S",55.555555555555557]
["Biraldo",27,72,"S",35.25925925925926]
["Bird",17,110,"D",57.450980392156858]
["Biscuit",27,89,"S",29.592592592592595]
["Bistro",21,73,"S",51.857142857142861]
["Bit of a Pickle",24,95,"D",35]
["Bit of Masquerade",20,69,"S",57]
["Bite My Dust",22,84,"S",44.727272727272727]
["Bits",16,88,"S",70.666666666666671]
["Bitsy",21,95,"D",44.523809523809526]
["BJ",15,69,"S",83.666666666666657]
["Black",21,84,"S",48.19047619047619]
["Black Bar",22,75,"S",47.727272727272727]
["Black Bart",20,90,"S",50]
["Black Beauty",22,79,"S",46.393939393939391]
["Black Bess",21,96,"D",44.19047619047619]
["Black Future",25,93,"D",33]
["Black Jack",23,84,"S",41.565217391304344]
["Black Kyber",19,101,"D",50.543859649122808]
["Black Lightning",19,65,"S",62.543859649122808]
["Black Magic",22,77,"S",47.060606060606062]
["Black Rose",16,72,"S",76]
["Black Shadows",26,91,"S",31.205128205128208]
["Black Showgirl",24,83,"S",39]
["Black Tide",20,91,"S",49.666666666666671]
["Black Tie Affair",25,76,"S",38.666666666666664]
["Black Toes",15,111,"S",69.666666666666657]
["Black Zephyr",20,90,"S",50]
["Blackberry",19,60,"S",64.21052631578948]
["Blackhawk",17,75,"S",69.117647058823536]
["Blackie",26,123,"S",20.53846153846154]
["Blackjack",27,98,"S",26.592592592592588]
["Blacky",18,69,"S",65.888888888888886]
["Blanca",24,94,"S",35.333333333333329]
["Blarney",18,66,"S",66.888888888888886]
["Blaster",24,101,"D",33]
["Blaze",24,82,"S",39.333333333333329]
["Blaze of Enchantment",24,61,"S",46.333333333333329]
["Blazing Berry",22,81,"S",45.727272727272727]
["Blazing Comet",27,97,"D",26.925925925925927]
["Blazing Heart",23,66,"S",47.565217391304344]
["Blazing Keel",21,87,"S",47.19047619047619]
["Blazing Speed",22,101,"D",39.060606060606062]
["Blessing",25,79,"S",37.666666666666664]
["Bling Bling",23,120,"D",29.565217391304348]
["Bliss",21,98,"S",43.523809523809518]
["Bliss",27,94,"D",27.925925925925924]
["Blissful",19,111,"D",47.210526315789473]
["Blitz",22,89,"S",43.060606060606062]
["Blitzen",27,98,"S",26.592592592592588]
["Blizzard",21,89,"S",46.523809523809526]
["Blondie",18,71,"S",65.222222222222229]
["Blossom",20,112,"D",42.666666666666671]
["Blue",16,94,"D",68.666666666666671]
["Blue Angel",16,80,"S",73.333333333333329]
["Blue Chip",20,80,"S",53.333333333333329]
["Blue Cloud",22,86,"S",44.060606060606062]
["Blue Eyed Bandit",23,67,"S",47.231884057971016]
["Blue Eyes",19,94,"D",52.877192982456137]
["Blue lands Rosey",15,95,"D",75]
["Blue Legend",23,90,"S",39.565217391304344]
["Blue Max",21,113,"D",38.523809523809518]
["Blue Moon",19,75,"S",59.210526315789473]
["Blue Murder",20,75,"S",55]
["Blue Patent",17,83,"S",66.450980392156865]
["Blue Stone",15,123,"S",65.666666666666671]
["Blue Valentine",26,112,"S",24.205128205128212]
["Bluebell",22,113,"S",35.060606060606062]
["Blueberry Hill",26,103,"D",27.205128205128212]
["Bluebird the Word",16,76,"S",74.666666666666671]
["Bluegrass",22,88,"S",43.393939393939391]
["Blueprint",27,96,"D",27.25925925925926]
["Blues Traveler",22,66,"S",50.727272727272727]
["Blustery",17,71,"S",70.450980392156865]
["Bo",27,86,"S",30.592592592592595]
["Bo Didley",15,116,"D",68]
["Bo Hunk",17,71,"S",70.450980392156865]
["Bob",23,83,"S",41.89855072463768]
["Boba Fett",22,86,"S",44.060606060606062]
["Bobbi",25,84,"S",36]
["Bobbie",19,93,"D",53.210526315789473]
["Bobby",20,116,"S",41.333333333333329]
["Bobby Jo",27,80,"S",32.592592592592595]
["Boe",22,96,"D",40.727272727272727]
["Boiling Beauty",22,82,"S",45.393939393939391]
["Bojangles",18,95,"D",57.222222222222229]
["Bolaro",20,100,"S",46.666666666666671]
["Bold Lad",22,122,"S",32.060606060606062]
["Bold Venture",17,101,"D",60.450980392156858]
["Bolero",22,78,"S",46.727272727272727]
["Bolt",19,75,"S",59.210526315789473]
["Bonzo",20,99,"D",47]
["Boo",19,94,"D",52.877192982456137]
["Booger",19,84,"S",56.210526315789473]
["Booger Baby",26,69,"S",38.53846153846154]
["Boogie",22,93,"D",41.727272727272727]
["Bookmark",19,108,"S",48.210526315789473]
["Boomer",19,65,"S",62.543859649122808]
["Boomerang",22,59,"S",53.060606060606062]
["Boots",19,99,"D",51.210526315789473]
["Boot's Scootn'",21,64,"S",54.857142857142861]
["Born To Be Bad",19,88,"S",54.877192982456137]
["Born To Do It",27,62,"S",38.592592592592595]
["Born To Fly",17,90,"S",64.117647058823536]
["Bossinova",16,66,"S",78]
["Bossy",26,101,"D",27.871794871794869]
["Boston",21,80,"S",49.523809523809526]
["Boston Cream",20,94,"D",48.666666666666671]
["Botanic",21,97,"D",43.857142857142861]
["Bounty",26,117,"S",22.53846153846154]
["Bourbon",15,99,"D",73.666666666666657]
["Bow",20,75,"S",55]
["Bow Tie",22,110,"D",36.060606060606062]
["Boy",22,100,"D",39.393939393939391]
["Bracken",21,93,"S",45.19047619047619]
["Bramble",26,88,"S",32.205128205128204]
["Branagan",27,64,"S",37.925925925925924]
["Brandon",25,83,"S",36.333333333333336]
["Brandy",20,123,"D",39]
["Brash n Sassy",21,75,"S",51.19047619047619]
["Brass Plum",15,108,"D",70.666666666666657]
["Brat",25,96,"S",32]
["Brave",15,79,"S",80.333333333333329]
["Brave One",18,61,"S",68.555555555555557]
["Brave Vision",22,91,"S",42.393939393939391]
["Braveheart",16,114,"D",62]
["Bravo",20,99,"S",47]
["Breeze",21,79,"S",49.857142857142861]
["Breeze Bar",27,94,"S",27.925925925925924]
["Breeze of the South",24,72,"S",42.666666666666671]
["Breezy",23,91,"S",39.231884057971016]
["Breman",17,118,"S",54.7843137254902]
["Brenner",18,86,"S",60.222222222222229]
["Brewski",17,80,"S",67.450980392156865]
["Brianna",25,122,"D",23.333333333333336]
["Bridal Run",25,93,"S",33]
["Brie",17,106,"S",58.784313725490208]
["Brigham",20,87,"S",51]
["Bright Idea",25,102,"S",30]
["British Banker",22,112,"D",35.393939393939391]
["Britt",19,96,"S",52.210526315789473]
["Brocco",22,98,"S",40.060606060606062]
["Broken Arrow",22,76,"S",47.393939393939391]
["Broker",18,74,"S",64.222222222222229]
["Bronson",18,85,"S",60.555555555555557]
["Bronze Cross",22,87,"S",43.727272727272727]
["Brook",18,104,"S",54.222222222222221]
["Brooke",16,87,"S",71]
["Brownie",20,81,"S",53]
["Bruce",21,87,"S",47.19047619047619]
["Bruiser",19,96,"S",52.210526315789473]
["Brunello",27,90,"S",29.25925925925926]
["Bruno",17,73,"S",69.784313725490193]
["Brutus",26,73,"S",37.205128205128204]
["Buba",21,85,"S",47.857142857142861]
["Bubba",22,121,"D",32.393939393939391]
["Bubble",21,70,"S",52.857142857142861]
["Bubble Gum",16,120,"S",60]
["Bubbles",21,102,"D",42.19047619047619]
["Bubs",23,66,"S",47.565217391304344]
["Buck",24,95,"D",35]
["Buck of Sugar",20,93,"D",49]
["Buck Or Two",20,82,"S",52.666666666666671]
["Buck-A-Roo",24,66,"S",44.666666666666671]
["Buckeroo Times Two",19,75,"S",59.210526315789473]
["Buckminster",18,100,"S",55.555555555555557]
["Buckshot",19,82,"S",56.877192982456137]
["Buckwheat",19,70,"S",60.877192982456137]
["Bucky",26,94,"D",30.205128205128208]
["Bud",17,77,"S",68.450980392156865]
["Buddy",21,82,"S",48.857142857142861]
["Budha",18,103,"S",54.555555555555557]
["Bueno",20,76,"S",54.666666666666664]
["Buffy",18,66,"S",66.888888888888886]
["Bugaboo",23,82,"S",42.231884057971016]
["Bugs",18,78,"S",62.888888888888886]
["Bugs Bunny",20,79,"S",53.666666666666671]
["Bugsy",22,110,"D",36.060606060606062]
["Bull Marker",20,92,"S",49.333333333333329]
["Bullet",19,75,"S",59.210526315789473]
["Bullseye",21,99,"S",43.19047619047619]
["Bumble",19,60,"S",64.21052631578948]
["Bumble Bee",26,83,"S",33.871794871794869]
["Bumbles",16,88,"S",70.666666666666671]
["Bumper",19,69,"S",61.210526315789473]
["Bumpkin",23,74,"S",44.89855072463768]
["Bumpy",27,90,"S",29.25925925925926]
["Bunny",27,83,"S",31.592592592592595]
["Burgandy Rose",19,70,"S",60.877192982456137]
["Burst of Stardust",22,60,"S",52.727272727272727]
["Busco",21,69,"S",53.19047619047619]
["Buster",19,100,"D",50.877192982456137]
["Butter",17,76,"S",68.784313725490193]
["Butterball",15,112,"D",69.333333333333343]
["Buttercup",17,92,"D",63.450980392156865]
["Butterfly",20,73,"S",55.666666666666664]
["Butterfly Kisses",19,78,"S",58.210526315789473]
["Buttermilk",17,94,"D",62.7843137254902]
["Butterscotch",18,78,"S",62.888888888888886]
["Butterworth",21,74,"S",51.523809523809526]
["Buttons",21,71,"S",52.523809523809526]
["Buzz",17,70,"S",70.784313725490193]
["Buzz Lightyear",23,91,"S",39.231884057971016]
["C.B.",20,94,"S",48.666666666666671]
["C.C.",21,95,"D",44.523809523809526]
["Cable",19,100,"S",50.877192982456137]
["Cactus",21,92,"S",45.523809523809526]
["Cadalac",22,64,"S",51.393939393939391]
["Cade",19,72,"S",60.210526315789473]
["Cadence",22,76,"S",47.393939393939391]
["Cadillac Jack",16,94,"D",68.666666666666671]
["Cadre Noir",19,97,"D",51.877192982456137]
["Caeser",16,117,"D",61]
["Cafe Latte",15,79,"S",80.333333333333329]
["Caine",24,72,"S",42.666666666666671]
["Cajun",23,116,"D",30.898550724637676]
["Calamity Jane",21,106,"D",40.857142857142861]
["Calico",20,73,"S",55.666666666666664]
["Caliméro",16,122,"D",59.333333333333336]
["Call Me",22,88,"S",43.393939393939391]
["Cally",17,122,"S",53.450980392156858]
["Calua",20,87,"S",51]
["Calvin",21,83,"S",48.523809523809526]
["Camanchi",21,94,"D",44.857142857142854]
["Cambridge",16,122,"D",59.333333333333336]
["Cameo",26,66,"S",39.53846153846154]
["Cammander",17,75,"S",69.117647058823536]
["Camoren",17,98,"D",61.450980392156858]
["Campari",24,65,"S",45]
["Campino",20,110,"S",43.333333333333329]
["Canada",27,90,"S",29.25925925925926]
["Canadian Winner",20,86,"S",51.333333333333329]
["Canal King",18,113,"D",51.222222222222221]
["Cancer",25,122,"D",23.333333333333336]
["Candlelight",17,111,"S",57.117647058823529]
["Candy",20,95,"D",48.333333333333329]
["Candy Apple",20,103,"S",45.666666666666671]
["Candy Kisses",17,73,"S",69.784313725490193]
["Candyman",24,73,"S",42.333333333333329]
["Cant Deny It",18,64,"S",67.555555555555557]
["Cant Get Enough",21,66,"S",54.19047619047619]
["Capella",21,99,"D",43.19047619047619]
["Caper",22,120,"D",32.727272727272727]
["Capitaine",25,67,"S",41.666666666666657]
["Cappicino",22,105,"D",37.727272727272727]
["Cappie",20,77,"S",54.333333333333329]
["Cappo",19,71,"S",60.543859649122808]
["Cappocina",20,90,"S",50]
["Cappuiccino",25,69,"S",41]
["Cappy",22,63,"S",51.727272727272727]
["Capriccio",19,91,"S",53.877192982456137]
["Capricorn",20,109,"D",43.666666666666671]
["Captain",15,74,"S",82]
["Captain Canada",19,85,"S",55.877192982456137]
["Caramel",20,103,"D",45.666666666666671]
["Caramel Sensation",26,97,"S",29.205128205128212]
["Caraway",22,100,"S",39.393939393939391]
["Carcajou",23,85,"S",41.231884057971016]
["Careless",20,59,"S",60.333333333333343]
["Carmel",18,86,"S",60.222222222222229]
["Carmella",16,86,"S",71.333333333333329]
["Carmen",17,70,"S",70.784313725490193]
["Carnation",16,117,"D",61]
["Carosel",20,76,"S",54.666666666666664]
["Carribou",18,77,"S",63.222222222222229]
["Carrie",15,71,"S",83]
["Carrots",20,98,"D",47.333333333333329]
["Cartier",21,122,"D",35.523809523809518]
["Cartoon",19,100,"S",50.877192982456137]
["Carumba",20,94,"D",48.666666666666671]
["Carver",21,90,"S",46.19047619047619]
["Casanova",24,86,"S",38]
["Cascade",19,63,"S",63.210526315789473]
["Casey",20,89,"S",50.333333333333329]
["Cash",18,99,"D",55.888888888888886]
["Cash the Check",22,97,"S",40.393939393939391]
["Casper",20,82,"S",52.666666666666671]
["Caspian",24,63,"S",45.666666666666671]
["Casse Noisette",25,106,"D",28.666666666666664]
["Cassidy",17,100,"D",60.784313725490208]
["Cassie",20,77,"S",54.333333333333329]
["Cast No Shadow",15,113,"D",69]
["Castaway",19,88,"S",54.877192982456137]
["Castle Rock",21,97,"D",43.857142857142861]
["Catamaran",15,68,"S",84]
["Catch The Wind",22,121,"S",32.393939393939391]
["Caution",19,81,"S",57.210526315789473]
["Cava",16,65,"S",78.333333333333329]
["Cavier",22,95,"D",41.060606060606062]
["Caz",23,91,"S",39.231884057971016]
["Ceasar",22,91,"S",42.393939393939391]
["Cedar",26,62,"S",40.871794871794869]
["Ceffyl",18,104,"D",54.222222222222221]
["Celandine",15,94,"D",75.333333333333329]
["Celebrity",21,72,"S",52.19047619047619]
["Celeste",16,91,"S",69.666666666666671]
["Cellini",21,96,"S",44.19047619047619]
["Celtic Charm",26,83,"S",33.871794871794869]
["Celtic Jewel",22,84,"S",44.727272727272727]
["Celtic Rose",18,64,"S",67.555555555555557]
["Celtic Shot",22,99,"D",39.727272727272727]
["Celtic Sun",18,82,"S",61.555555555555557]
["Century",19,87,"S",55.210526315789473]
["Century's Odyssey",19,79,"S",57.877192982456137]
["Céphée",16,81,"S",73]
["Cera",19,73,"S",59.877192982456137]
["Ceres",21,75,"S",51.19047619047619]
["Cha-Cha",18,117,"D",49.888888888888886]
["Chad",25,84,"S",36]
["Chakote",23,84,"S",41.565217391304344]
["Chalk",27,94,"D",27.925925925925924]
["Challie",22,69,"S",49.727272727272727]
["Cham",24,83,"S",39]
["Chamber",19,72,"S",60.210526315789473]
["Chamlan",21,59,"S",56.523809523809518]
["Champagne",21,100,"D",42.857142857142861]
["Champagne on Deck",23,78,"S",43.565217391304344]
["Champane",26,75,"S",36.53846153846154]
["Champion",26,71,"S",37.871794871794869]
["Champion Heartache",24,82,"S",39.333333333333329]
["Chance",18,82,"S",61.555555555555557]
["Chance gets Lucky",24,98,"S",34]
["Chancer",19,71,"S",60.543859649122808]
["Chances Dream",22,95,"D",41.060606060606062]
["Chance's Wish",16,76,"S",74.666666666666671]
["Chancey",24,118,"D",27.333333333333336]
["Channel",20,89,"S",50.333333333333329]
["Channel Three",26,96,"D",29.53846153846154]
["Chaos",16,83,"S",72.333333333333329]
["Char Do Neigh",15,117,"D",67.666666666666671]
["Charger",20,74,"S",55.333333333333336]
["Chargey",18,97,"D",56.555555555555557]
["Charished Hope",22,104,"D",38.060606060606062]
["Charisma",25,78,"S",38]
["Charity",22,95,"D",41.060606060606062]
["Charlene",22,111,"D",35.727272727272727]
["Charles",25,72,"S",40]
["Charlie",20,107,"S",44.333333333333329]
["Charlie Bean",26,72,"S",37.53846153846154]
["Charlie Brown",24,64,"S",45.333333333333329]
["Charlies Angel",16,93,"S",69]
["Charlies Next",17,96,"D",62.117647058823529]
["Charm",19,99,"D",51.210526315789473]
["Charmed",25,123,"S",23]
["Charmer",19,83,"S",56.543859649122808]
["Charrished Secret",20,64,"S",58.666666666666657]
["Chase",22,82,"S",45.393939393939391]
["Chattanooga Choo Choo",18,104,"D",54.222222222222221]
["Chatterbox",16,102,"D",66]
["Chebe",19,100,"D",50.877192982456137]
["Checkers",27,87,"S",30.25925925925926]
["Cheeky",19,62,"S",63.543859649122808]
["Cheerioes",26,59,"S",41.871794871794876]
["Cheetah",21,123,"D",35.19047619047619]
["Chelsea",19,60,"S",64.21052631578948]
["Cher",21,80,"S",49.523809523809526]
["Cherab",16,94,"S",68.666666666666671]
["Cherish",21,115,"D",37.857142857142861]
["Cherish the Moment",22,71,"S",49.060606060606062]
["Cherokee",26,62,"S",40.871794871794869]
["Cherokee Chief",21,86,"S",47.523809523809526]
["Cherokee Promise",25,65,"S",42.333333333333343]
["Cherokee Rose",20,70,"S",56.666666666666657]
["Cheska",26,88,"S",32.205128205128204]
["Chess",25,73,"S",39.666666666666664]
["Chess Player",22,82,"S",45.393939393939391]
["Chester",25,119,"S",24.333333333333336]
["Chesterfield",24,99,"D",33.666666666666664]
["Chevy",17,119,"D",54.450980392156858]
["Chewbacca",25,102,"S",30]
["Chewy",18,95,"D",57.222222222222229]
["Chex",22,120,"S",32.727272727272727]
["Cheyanne",19,60,"S",64.21052631578948]
["Cheyenne",25,75,"S",39]
["Chianti",26,81,"S",34.53846153846154]
["Chic in Time",26,71,"S",37.871794871794869]
["Chicagos Lady",20,84,"S",52]
["Chick",18,89,"S",59.222222222222229]
["Chickaboo",20,96,"D",48]
["Chicken",17,85,"S",65.784313725490193]
["Chicky",17,107,"D",58.450980392156858]
["Chico",20,93,"D",49]
["Chief",22,93,"D",41.727272727272727]
["Chiko",21,89,"S",46.523809523809526]
["Chilla",16,80,"S",73.333333333333329]
["Chilli",15,77,"S",81]
["Chimera",20,95,"S",48.333333333333329]
["China's Gold",21,72,"S",52.19047619047619]
["Chino",24,90,"S",36.666666666666664]
["Chinook",20,65,"S",58.333333333333343]
["Chip",26,104,"D",26.871794871794869]
["Chippy",21,81,"S",49.19047619047619]
["Chips",20,92,"S",49.333333333333329]
["Chipwich",24,74,"S",42]
["Chiquita",20,101,"D",46.333333333333329]
["Chiquito",26,100,"D",28.205128205128212]
["Chloe",22,108,"S",36.727272727272727]
["Chocolate",23,78,"S",43.565217391304344]
["Chocolate",15,121,"D",66.333333333333343]
["Chocolate Brownie",15,74,"S",82]
["Chocolate Chip",22,67,"S",50.393939393939391]
["Chocolate Chip Surprise",27,100,"D",25.925925925925927]
["Chocolate Covered Marshmallows",23,77,"S",43.89855072463768]
["Chocolate Mocha",25,88,"S",34.666666666666664]
["Chocolate Sundae",19,65,"S",62.543859649122808]
["Choctaw",21,92,"D",45.523809523809526]
["Choice",23,61,"S",49.231884057971016]
["Christmas in July",27,85,"S",30.925925925925924]
["Christopher Robin",26,91,"S",31.205128205128208]
["Chrome",24,94,"D",35.333333333333329]
["Chrystal and Roses",19,121,"S",43.877192982456137]
["Chuck",16,60,"S",80]
["Chuckles",16,84,"S",72]
["Chunky",22,74,"S",48.060606060606062]
["Chynas Silk",24,119,"D",27]
["Cider",26,83,"S",33.871794871794869]
["Cimarron",20,96,"D",48]
["Cimeron",19,65,"S",62.543859649122808]
["Cinamon",18,82,"S",61.555555555555557]
["Cincinatti",21,85,"S",47.857142857142861]
["Cincinnati's Treasure",15,94,"D",75.333333333333329]
["Cinderella",17,119,"D",54.450980392156858]
["Cinders",20,77,"S",54.333333333333329]
["Cindy",21,66,"S",54.19047619047619]
["Cinnamon",18,94,"S",57.555555555555557]
["Cinnamon Toast",18,90,"S",58.888888888888886]
["Cippy",15,118,"S",67.333333333333343]
["Cirrus",20,84,"S",52]
["Cisco",21,89,"S",46.523809523809526]
["Cisco Kid",22,60,"S",52.727272727272727]
["Citation",20,79,"S",53.666666666666671]
["City",17,104,"D",59.450980392156858]
["City Girl",21,73,"S",51.857142857142861]
["CJ",19,107,"S",48.543859649122808]
["Clancy",20,100,"S",46.666666666666671]
["Classic",16,116,"S",61.333333333333336]
["Classic Touch",19,119,"D",44.543859649122808]
["Classical Dancer",23,76,"S",44.231884057971016]
["Classy",25,119,"D",24.333333333333336]
["Classy Dancer",23,111,"S",32.565217391304344]
["Clear",16,86,"S",71.333333333333329]
["Clear Red",21,118,"S",36.857142857142861]
["Clemantine",25,91,"S",33.666666666666664]
["Cleo",18,70,"S",65.555555555555557]
["Clever Trick",17,100,"S",60.784313725490208]
["Clifford",19,82,"S",56.877192982456137]
["Cloe",24,99,"D",33.666666666666664]
["Clone Lass",15,122,"D",66]
["Cloud",27,100,"S",25.925925925925927]
["Cloud 9",18,71,"S",65.222222222222229]
["Cloud Dancer",25,94,"D",32.666666666666664]
["Cloud Dancing",21,112,"S",38.857142857142861]
["Cloud Nine",22,109,"S",36.393939393939391]
["Cloven",26,105,"S",26.53846153846154]
["Clover",27,60,"S",39.25925925925926]
["Clueless",20,122,"D",39.333333333333329]
["Cluster",17,64,"S",72.784313725490193]
["Clyde",26,109,"S",25.205128205128212]
["Coal",23,97,"D",37.231884057971023]
["Cobalt",22,68,"S",50.060606060606062]
["Cobweb",18,115,"D",50.555555555555557]
["Coby",26,69,"S",38.53846153846154]
["Coca-Cola",20,79,"S",53.666666666666671]
["Coccinelle",25,89,"S",34.333333333333336]
["Cochise",27,74,"S",34.592592592592595]
["Cochise Warfeather",16,112,"S",62.666666666666664]
["Cocklebur",15,77,"S",81]
["Coco",22,73,"S",48.393939393939391]
["Coco",25,80,"S",37.333333333333336]
["Co-Co",22,76,"S",47.393939393939391]
["Coco Lady",18,91,"S",58.555555555555557]
["Coco Puffs",22,96,"S",40.727272727272727]
["Cocoamo",27,116,"D",20.592592592592592]
["Coconut",27,85,"S",30.925925925925924]
["Coco-Rose",27,84,"S",31.25925925925926]
["Code Blue",21,99,"D",43.19047619047619]
["Cody",26,79,"S",35.205128205128204]
["Colby",18,92,"S",58.222222222222229]
["Cole",20,100,"S",46.666666666666671]
["Colin",20,93,"D",49]
["Color Field",16,76,"S",74.666666666666671]
["Color Me Bad",22,117,"S",33.727272727272727]
["Color Me Crazy",21,120,"D",36.19047619047619]
["Color Me Pretty",19,119,"S",44.543859649122808]
["Color Me Red",15,66,"S",84.666666666666657]
["Colorado",22,94,"S",41.393939393939391]
["Coloring Book",26,63,"S",40.53846153846154]
["Colors Of The Wind",18,118,"S",49.555555555555557]
["Coltyn",17,61,"S",73.784313725490193]
["Columbo",17,93,"D",63.117647058823529]
["Comanche",16,79,"S",73.666666666666671]
["Comet",19,60,"S",64.21052631578948]
["Command Performance",22,73,"S",48.393939393939391]
["Condor",18,113,"D",51.222222222222221]
["Confetti",21,97,"D",43.857142857142861]
["Confetti's Cowboy",23,71,"S",45.89855072463768]
["Confidental",18,72,"S",64.888888888888886]
["Congarie",24,70,"S",43.333333333333329]
["Conker",25,84,"S",36]
["Conquest",23,73,"S",45.231884057971016]
["Conrad",26,104,"D",26.871794871794869]
["Contiki",18,72,"S",64.888888888888886]
["Conztanza",23,99,"D",36.565217391304344]
["Coocoo For Coconuts",19,113,"S",46.543859649122808]
["Cookie",16,110,"D",63.333333333333336]
["Cookie Dough",17,100,"D",60.784313725490208]
["Cookies 'n' Cream",17,87,"S",65.117647058823536]
["Cool Dawn",26,82,"S",34.205128205128204]
["Cool Mount",23,122,"S",28.898550724637676]
["Coosa",21,82,"S",48.857142857142861]
["Cooter",21,81,"S",49.19047619047619]
["CoPilot",22,80,"S",46.060606060606062]
["Copper",27,83,"S",31.592592592592595]
["Copper Glow",21,104,"D",41.523809523809518]
["Copper Penny",19,88,"S",54.877192982456137]
["Copperhead",18,117,"S",49.888888888888886]
["Copy Cat",24,87,"S",37.666666666666664]
["Corey",17,59,"S",74.450980392156865]
["Cork",23,84,"S",41.565217391304344]
["Corn",16,111,"S",63]
["Cornol",20,96,"D",48]
["Coshy",16,82,"S",72.666666666666671]
["Cosmic Flower",19,87,"S",55.210526315789473]
["Cosmo",22,99,"D",39.727272727272727]
["Costal Sunset",21,114,"S",38.19047619047619]
["Cotton",21,87,"S",47.19047619047619]
["Cougar",27,93,"S",28.25925925925926]
["Count",15,69,"S",83.666666666666657]
["Courageous",15,93,"D",75.666666666666657]
["Coureur des Bois",20,112,"D",42.666666666666671]
["Court Jester",23,72,"S",45.565217391304344]
["Courvosier",24,71,"S",43]
["Cover Girl",21,92,"D",45.523809523809526]
["Cover Story",21,113,"D",38.523809523809518]
["Cowboy",16,81,"S",73]
["Cowboy Joe",22,63,"S",51.727272727272727]
["Cowboys Delight",17,113,"D",56.450980392156858]
["Cowboy's Dream",20,98,"S",47.333333333333329]
["Cowboy's First Choice",17,77,"S",68.450980392156865]
["Cowboys Golden Blizzard",19,106,"S",48.877192982456137]
["Cowboy's Revege",18,74,"S",64.222222222222229]
["Cowgirl",24,76,"S",41.333333333333329]
["Coyote",21,86,"S",47.523809523809526]
["Cracker Barrel",16,60,"S",80]
["Cracker Jack",17,118,"S",54.7843137254902]
["Crackerjack",17,92,"S",63.450980392156865]
["Crazy",22,96,"S",40.727272727272727]
["Crazy Dream",19,106,"S",48.877192982456137]
["Crazy Paint",23,71,"S",45.89855072463768]
["Cream",16,95,"S",68.333333333333329]
["Creme Soda",25,111,"S",27]
["Cremmdalla Crem",18,59,"S",69.222222222222229]
["Creola Rosette",19,65,"S",62.543859649122808]
["Creole",25,101,"D",30.333333333333336]
["Cricket",22,75,"S",47.727272727272727]
["Crimson",21,87,"S",47.19047619047619]
["Crisp",25,75,"S",39]
["Crispy",25,107,"S",28.333333333333336]
["Crissy",17,113,"D",56.450980392156858]
["Cristabell",22,79,"S",46.393939393939391]
["Crocuzula",24,92,"S",36]
["Cross Roads",18,92,"D",58.222222222222229]
["Crouching Tiger",15,60,"S",86.666666666666671]
["Crown Royal",20,81,"S",53]
["Cruise",25,78,"S",38]
["Cruser",19,87,"S",55.210526315789473]
["Crystal",15,90,"S",76.666666666666657]
["Cuddles",21,97,"D",43.857142857142861]
["Cuervo",17,80,"S",67.450980392156865]
["Culver",15,92,"S",76]
["Cupid",21,81,"S",49.19047619047619]
["Cupids Cowboy",15,61,"S",86.333333333333329]
["Curiosity",18,73,"S",64.555555555555557]
["Curious",23,82,"S",42.231884057971016]
["Curiso",22,88,"S",43.393939393939391]
["Curley",20,97,"S",47.666666666666671]
["Curly",22,75,"S",47.727272727272727]
["Curly-q",20,88,"S",50.666666666666671]
["Curtain Call",27,62,"S",38.592592592592595]
["Custer",25,123,"D",23]
["Cut The Cuteness",22,94,"D",41.393939393939391]
["Cute As A Button",16,80,"S",73.333333333333329]
["Cute Tee",15,69,"S",83.666666666666657]
["Cute Wedding",21,114,"D",38.19047619047619]
["Cutest lil' babyface",20,69,"S",57]
["Cutter",19,63,"S",63.210526315789473]
["Cyclone",19,72,"S",60.210526315789473]
["Cymba",20,75,"S",55]
["Cymbal",16,84,"S",72]
["Cyndara",26,64,"S",40.205128205128204]
["Cypress Way",20,96,"S",48]
["Cyrus",16,106,"D",64.666666666666657]
["Czar",25,60,"S",44]
["Daddys Dollars",23,90,"S",39.565217391304344]
["Daddy's Overdraft",26,115,"D",23.205128205128212]
["Daggers Point",19,60,"S",64.21052631578948]
["Dagworth Maestro",23,67,"S",47.231884057971016]
["Dairy Cream",17,89,"S",64.450980392156865]
["Daisy",19,75,"S",59.210526315789473]
["Daisy Mama",26,68,"S",38.871794871794869]
["Daisy May",27,73,"S",34.925925925925924]
["Dakota",17,99,"D",61.117647058823529]
["Dakota Dreamer",20,112,"D",42.666666666666671]
["Dakota Grace",15,78,"S",80.666666666666657]
["Dakota Smith",23,81,"S",42.565217391304344]
["Dale",24,78,"S",40.666666666666664]
["Dalesman",24,109,"S",30.333333333333336]
["Dallas",20,92,"S",49.333333333333329]
["Dalton",23,100,"S",36.231884057971023]
["Dame de Pique",23,95,"D",37.89855072463768]
["Dameon",24,88,"S",37.333333333333329]
["Damien",22,91,"S",42.393939393939391]
["Damsel",19,102,"D",50.210526315789473]
["Dan",22,66,"S",50.727272727272727]
["Dance Away",23,80,"S",42.89855072463768]
["Dancer",22,120,"D",32.727272727272727]
["Dancing Queen",21,117,"D",37.19047619047619]
["Dandelion",27,105,"S",24.25925925925926]
["Dandi",20,72,"S",56]
["Dandy",15,122,"S",66]
["Dandy Suitor",20,76,"S",54.666666666666664]
["D'Angelo",22,80,"S",46.060606060606062]
["Dani",20,121,"S",39.666666666666671]
["Daniel",18,69,"S",65.888888888888886]
["Danny",27,79,"S",32.925925925925924]
["Danny Boy",26,75,"S",36.53846153846154]
["Dante",24,122,"S",26]
["Dapple",18,95,"S",57.222222222222229]
["Dapple Apple",23,63,"S",48.565217391304344]
["Daquiri",22,64,"S",51.393939393939391]
["Darby",20,108,"D",44]
["Darcy",15,108,"D",70.666666666666657]
["Dare to Dream",19,91,"S",53.877192982456137]
["Daredevil",15,76,"S",81.333333333333329]
["Daring Dancer",21,64,"S",54.857142857142861]
["Darius",22,116,"S",34.060606060606062]
["Dark Intentions",16,67,"S",77.666666666666671]
["Dark Secret",17,80,"S",67.450980392156865]
["Dark Squawl",21,103,"D",41.857142857142861]
["Darkness",19,85,"S",55.877192982456137]
["Darling",26,64,"S",40.205128205128204]
["Dash of Class",24,104,"D",31.999999999999996]
["Dasher",17,112,"D",56.784313725490208]
["Dava",15,104,"D",72]
["Davis",26,68,"S",38.871794871794869]
["Dawn",19,85,"S",55.877192982456137]
["Dawning Hope",22,82,"S",45.393939393939391]
["Dawson",22,91,"S",42.393939393939391]
["Dax",26,69,"S",38.53846153846154]
["Day by Day",19,104,"D",49.543859649122808]
["Day Trader",25,61,"S",43.666666666666671]
["Daybreak",20,76,"S",54.666666666666664]
["Days of Thunder",20,75,"S",55]
["Dayspring",24,86,"S",38]
["Daze",17,82,"S",66.784313725490193]
["Dazling Spirit",24,66,"S",44.666666666666671]
["Dazzle",19,82,"S",56.877192982456137]
["Dazzle'n'Daze",25,119,"D",24.333333333333336]
["Dazzler",23,120,"S",29.565217391304348]
["Deacon",17,103,"D",59.784313725490208]
["Deal Me In",15,92,"S",76]
["Deano",20,121,"D",39.666666666666671]
["Dear Abby",18,88,"S",59.555555555555557]
["Deck of Cards",25,120,"D",24]
["Decker",19,68,"S",61.543859649122808]
["Decoder",25,112,"S",26.666666666666664]
["Dee",20,78,"S",54]
["Dee Dee",17,104,"D",59.450980392156858]
["Deep Line",22,69,"S",49.727272727272727]
["Deep Pacific",26,72,"S",37.53846153846154]
["Déja Vue",17,102,"D",60.117647058823529]
["Delia",20,104,"D",45.333333333333329]
["Delilah",18,92,"D",58.222222222222229]
["Delphine",24,76,"S",41.333333333333329]
["Delta",15,115,"D",68.333333333333343]
["Demi",19,121,"D",43.877192982456137]
["Demiguise",22,94,"D",41.393939393939391]
["Denali,",15,87,"S",77.666666666666657]
["Denmark",22,67,"S",50.393939393939391]
["Denni",16,72,"S",76]
["Dennis",17,110,"S",57.450980392156858]
["Dennis the Menace",23,97,"S",37.231884057971023]
["Denver",19,75,"S",59.210526315789473]
["Dependable",15,82,"S",79.333333333333329]
["Depth Charge",21,100,"S",42.857142857142861]
["Deputy",19,75,"S",59.210526315789473]
["Derby",25,110,"D",27.333333333333336]
["Descaro",18,84,"S",60.888888888888886]
["Desert angel",15,85,"S",78.333333333333329]
["Desert King",19,81,"S",57.210526315789473]
["Desert Mirage",19,120,"D",44.210526315789473]
["Desert Rays",17,91,"S",63.784313725490193]
["Desert Sands",19,101,"D",50.543859649122808]
["Desert Storm",21,60,"S",56.19047619047619]
["Designated Prints",20,100,"D",46.666666666666671]
["Desirae",25,67,"S",41.666666666666657]
["Desire",18,101,"S",55.222222222222221]
["Destin To Dream",23,66,"S",47.565217391304344]
["Destination",24,77,"S",41]
["Destine To Be",19,103,"D",49.877192982456137]
["Destiny",20,86,"S",51.333333333333329]
["Deuce",15,120,"D",66.666666666666671]
["Devi",19,83,"S",56.543859649122808]
["Devil's Advocate",15,62,"S",86]
["Devil's Choas",23,111,"D",32.565217391304344]
["Devil's Fire",17,90,"S",64.117647058823536]
["Devil's Myth",22,80,"S",46.060606060606062]
["Devious",19,100,"D",50.877192982456137]
["Devon",18,78,"S",62.888888888888886]
["Dew Drop",19,83,"S",56.543859649122808]
["Dex",18,89,"S",59.222222222222229]
["Dexter",26,59,"S",41.871794871794876]
["Diablo",16,81,"S",73]
["Diago",20,69,"S",57]
["Dia'Mante",19,99,"S",51.210526315789473]
["Diamond",15,65,"S",85]
["Diamond Dancer",25,86,"S",35.333333333333336]
["Diamond Flame",19,89,"S",54.543859649122808]
["Diamond in the Rough",16,72,"S",76]
["Diamond In The Sky",23,89,"S",39.89855072463768]
["Diamond Rock",21,118,"D",36.857142857142861]
["Diamond Someday",19,81,"S",57.210526315789473]
["Diamond Star",22,62,"S",52.060606060606062]
["Diamonds 'R Us",20,101,"S",46.333333333333329]
["Diana",17,97,"D",61.784313725490208]
["Dibble",22,68,"S",50.060606060606062]
["Dibby",16,111,"S",63]
["Dick",22,69,"S",49.727272727272727]
["Diego",19,80,"S",57.543859649122808]
["Digby",19,62,"S",63.543859649122808]
["Digger",24,82,"S",39.333333333333329]
["Dillan",15,84,"S",78.666666666666657]
["Dilly",15,98,"D",74]
["DiMazio",25,63,"S",43]
["Dime a Dozen",15,89,"S",77]
["Dimple",22,93,"S",41.727272727272727]
["Dineena",21,119,"D",36.523809523809518]
["Dines",19,120,"D",44.210526315789473]
["Dinky",22,104,"D",38.060606060606062]
["Dipsy",20,83,"S",52.333333333333329]
["Dirrty",17,106,"S",58.784313725490208]
["Dirty Harry",21,109,"S",39.857142857142861]
["Disani",22,71,"S",49.060606060606062]
["Disco",17,99,"D",61.117647058823529]
["Disney Land",24,75,"S",41.666666666666671]
["Ditto",18,104,"S",54.222222222222221]
["Diva",21,86,"S",47.523809523809526]
["Diva By Blood",15,74,"S",82]
["Diva Dancer",22,83,"S",45.060606060606062]
["Dixie",24,75,"S",41.666666666666671]
["Dixie Chick",26,60,"S",41.53846153846154]
["Dixie Conclusion",21,116,"S",37.523809523809518]
["Dixie Delight",19,118,"S",44.877192982456137]
["Dixie Land Delight",15,81,"S",79.666666666666657]
["DJ",20,77,"S",54.333333333333329]
["Dobber",16,71,"S",76.333333333333329]
["Dobbin",20,75,"S",55]
["Doc",26,79,"S",35.205128205128204]
["Doc Holiday",20,117,"D",41]
["Dock a da Bay",19,117,"D",45.210526315789473]
["Docs Buck'n Baby",21,80,"S",49.523809523809526]
["Docs Rock",20,83,"S",52.333333333333329]
["Doctor Feelgood",18,100,"S",55.555555555555557]
["Doctor Johnny",20,75,"S",55]
["Doctor Tari",26,69,"S",38.53846153846154]
["Dog Bone",27,87,"S",30.25925925925926]
["Dolby",16,94,"S",68.666666666666671]
["Dollar",22,109,"S",36.393939393939391]
["Dolly",26,69,"S",38.53846153846154]
["Dolphin",27,122,"D",18.592592592592592]
["Domingo",21,76,"S",50.857142857142861]
["Dominion",23,121,"S",29.231884057971023]
["Domino",18,72,"S",64.888888888888886]
["Don Juan",21,97,"S",43.857142857142861]
["Donald",20,81,"S",53]
["Donatello",21,59,"S",56.523809523809518]
["Donner",24,81,"S",39.666666666666664]
["Don't Go",19,91,"S",53.877192982456137]
["Don't Know",18,75,"S",63.888888888888886]
["Dont Stop",19,84,"S",56.210526315789473]
["Donut",19,90,"S",54.210526315789473]
["Dooby",25,96,"S",32]
["Doodle-Bug",20,84,"S",52]
["Dopey",21,111,"S",39.19047619047619]
["Dora",17,103,"D",59.784313725490208]
["Doris",21,87,"S",47.19047619047619]
["Dorito",21,84,"S",48.19047619047619]
["Dorn",25,96,"D",32]
["Dorothy",19,69,"S",61.210526315789473]
["Dottso",16,69,"S",77]
["Double Delight",17,95,"D",62.450980392156865]
["Double Indemnity",20,71,"S",56.333333333333343]
["Double Trouble",19,90,"S",54.210526315789473]
["Dougal",22,83,"S",45.060606060606062]
["Douglas",20,68,"S",57.333333333333343]
["Doulton",19,100,"D",50.877192982456137]
["Dr. Pepper",15,74,"S",82]
["Dr.Jumpsalot",19,83,"S",56.543859649122808]
["Draco",22,89,"S",43.060606060606062]
["Draft",15,107,"S",71]
["Dragon",19,75,"S",59.210526315789473]
["Dragonfly",20,101,"S",46.333333333333329]
["Drakar",21,80,"S",49.523809523809526]
["Dream",18,91,"S",58.555555555555557]
["Dream Catcher",16,78,"S",74]
["Dream Come True",16,88,"S",70.666666666666671]
["Dream Of Mine",21,63,"S",55.19047619047619]
["Dream On",20,91,"S",49.666666666666671]
["Dream Size",19,81,"S",57.210526315789473]
["Dream Trail",21,80,"S",49.523809523809526]
["Dream Weaver",16,96,"S",68]
["Dreamer",18,91,"S",58.555555555555557]
["Dreamkeeper",17,79,"S",67.784313725490193]
["Dreams Of Silver",21,68,"S",53.523809523809526]
["Dreamy",17,106,"D",58.784313725490208]
["Dressage Diva",24,98,"D",34]
["Drift",22,90,"S",42.727272727272727]
["Drifter",22,59,"S",53.060606060606062]
["Driftwood Pacific",22,61,"S",52.393939393939391]
["Drop Dead Gorgeous",21,60,"S",56.19047619047619]
["Drove",25,116,"S",25.333333333333336]
["Druckster",26,77,"S",35.871794871794869]
["Drue",18,100,"D",55.555555555555557]
["Drum",17,68,"S",71.450980392156865]
["Drummer",15,100,"S",73.333333333333343]
["Dryad",17,100,"D",60.784313725490208]
["Duchess",23,90,"S",39.565217391304344]
["Dude",20,85,"S",51.666666666666671]
["Dudley",19,73,"S",59.877192982456137]
["Duke",19,83,"S",56.543859649122808]
["Dulcinea",16,72,"S",76]
["Dundee",16,90,"S",70]
["Dune",17,96,"D",62.117647058823529]
["Duo",20,96,"D",48]
["Durack",15,74,"S",82]
["Duran",22,91,"S",42.393939393939391]
["Durango",17,86,"S",65.450980392156865]
["Duranimo",22,101,"S",39.060606060606062]
["Duskany",19,106,"D",48.877192982456137]
["Dust Bunny",21,94,"D",44.857142857142854]
["Dustbuster",18,68,"S",66.222222222222229]
["Duster",22,69,"S",49.727272727272727]
["Dusty",23,99,"D",36.565217391304344]
["Dusty Cheyanne",19,107,"D",48.543859649122808]
["Dusty Duke",24,115,"S",28.333333333333336]
["Dusty Lady",21,78,"S",50.19047619047619]
["Dusty Moon",19,114,"S",46.210526315789473]
["Dusty Treasure",22,74,"S",48.060606060606062]
["Dutch",22,94,"D",41.393939393939391]
["Dutchess",26,65,"S",39.871794871794869]
["Dylan",27,68,"S",36.592592592592595]
["Dynamite",22,99,"S",39.727272727272727]
["Dynamite Jack",19,113,"S",46.543859649122808]
["E.Z. Rider",15,72,"S",82.666666666666657]
["Eagle",24,59,"S",47]
["Eagle Eye",18,65,"S",67.222222222222229]
["Eagle Spirit",19,79,"S",57.877192982456137]
["Ears",17,81,"S",67.117647058823536]
["Easy Girl",24,87,"S",37.666666666666664]
["Easy Street",21,94,"D",44.857142857142854]
["Eben",19,95,"D",52.543859649122808]
["Ebony",20,80,"S",53.333333333333329]
["Ebony Everthing",17,99,"S",61.117647058823529]
["Ebony Knight",18,121,"S",48.555555555555557]
["Ebony Princess",17,75,"S",69.117647058823536]
["Ebony Rose",19,84,"S",56.210526315789473]
["Echo",27,83,"S",31.592592592592595]
["Eclipse",17,68,"S",71.450980392156865]
["Eco",21,59,"S",56.523809523809518]
["Ed",15,97,"D",74.333333333333343]
["Edda",19,70,"S",60.877192982456137]
["Eddie",27,69,"S",36.25925925925926]
["Eddy",22,78,"S",46.727272727272727]
["Edelmann",20,95,"S",48.333333333333329]
["Edelweiss",27,80,"S",32.592592592592595]
["Edgar",19,98,"D",51.543859649122808]
["Edge",17,92,"D",63.450980392156865]
["Edgy",22,71,"S",49.060606060606062]
["Edna",16,96,"S",68]
["Edwin",26,92,"S",30.871794871794869]
["Egyption Wind",25,96,"D",32]
["El Dorado",18,106,"D",53.555555555555557]
["El Paso",20,111,"S",43]
["Eldorado",17,91,"S",63.784313725490193]
["Eleanore Rigby",17,96,"S",62.117647058823529]
["Elegance",20,107,"D",44.333333333333329]
["Elessar",17,84,"S",66.117647058823536]
["Eli",27,89,"S",29.592592592592595]
["Elijah",21,123,"D",35.19047619047619]
["Elipsis Blue",22,87,"S",43.727272727272727]
["Elita",21,79,"S",49.857142857142861]
["Elizabeth",23,121,"D",29.231884057971023]
["Ellen",27,82,"S",31.925925925925924]
["Ellie",15,73,"S",82.333333333333329]
["Elliot",18,77,"S",63.222222222222229]
["Elmo",15,77,"S",81]
["Eloquence",21,78,"S",50.19047619047619]
["Elusive",20,105,"D",45]
["Elusive Enchantment",15,85,"S",78.333333333333329]
["Elvis",20,64,"S",58.666666666666657]
["Ely",19,114,"D",46.210526315789473]
["Elzar",26,111,"D",24.53846153846154]
["Emanon",20,81,"S",53]
["Ember",27,97,"S",26.925925925925927]
["Embrace",24,84,"S",38.666666666666664]
["Emerald",23,110,"D",32.898550724637673]
["Emerald Fire",26,91,"S",31.205128205128208]
["Emily",22,123,"D",31.727272727272727]
["Emily Elizabeth",24,75,"S",41.666666666666671]
["Emma",17,69,"S",71.117647058823536]
["Emma Lee",26,85,"S",33.205128205128204]
["Emmet",22,104,"S",38.060606060606062]
["Emmy",18,93,"D",57.888888888888886]
["Empire",19,91,"S",53.877192982456137]
["Empire City",19,77,"S",58.543859649122808]
["Empress",21,80,"S",49.523809523809526]
["Enammored",24,87,"S",37.666666666666664]
["Enchanted",22,107,"S",37.060606060606062]
["Enchantress",27,84,"S",31.25925925925926]
["Encore",15,94,"S",75.333333333333329]
["Endless Possibilites",19,101,"D",50.543859649122808]
["Enigma",22,97,"S",40.393939393939391]
["Enter Prize",22,85,"S",44.393939393939391]
["Entrepreneur",24,101,"D",33]
["Epic",18,79,"S",62.555555555555557]
["Epona",22,95,"S",41.060606060606062]
["Equinox",22,69,"S",49.727272727272727]
["Eric",20,75,"S",55]
["Erik the red",20,68,"S",57.333333333333343]
["Erika",21,110,"D",39.523809523809518]
["Ernie",20,94,"S",48.666666666666671]
["Eros",27,74,"S",34.592592592592595]
["Erwin",19,97,"S",51.877192982456137]
["Esazia",21,85,"S",47.857142857142861]
["Esprit",20,109,"D",43.666666666666671]
["Esquivo",22,109,"D",36.393939393939391]
["Essen",23,97,"S",37.231884057971023]
["Esteem",20,108,"D",44]
["Etch",22,93,"S",41.727272727272727]
["Eternal Flame",19,116,"S",45.543859649122808]
["Eternal Inpiration",21,98,"D",43.523809523809518]
["Etta",18,123,"D",47.888888888888886]
["European Blend",26,98,"S",28.871794871794865]
["Evan",22,88,"S",43.393939393939391]
["Evening Mist",27,73,"S",34.925925925925924]
["Evening Shade",19,66,"S",62.210526315789473]
["Evening Star",21,83,"S",48.523809523809526]
["Ever After",25,78,"S",38]
["Ever Clear",24,87,"S",37.666666666666664]
["Ever So Clever",23,110,"D",32.898550724637673]
["Evergreen",27,91,"S",28.925925925925924]
["Everlast",16,62,"S",79.333333333333329]
["Everything Nice",15,111,"D",69.666666666666657]
["Evita",26,104,"S",26.871794871794869]
["Excalibur",21,93,"D",45.19047619047619]
["Exchange Rate",23,86,"S",40.89855072463768]
["Exclamation Kid",17,94,"D",62.7843137254902]
["Exclusions",22,85,"S",44.393939393939391]
["Expecting to Fly",25,117,"D",25]
["Explorer's Quest",21,89,"S",46.523809523809526]
["Expresso",25,115,"S",25.666666666666664]
["Extraordinary",17,99,"D",61.117647058823529]
["Eye of the Storm",24,66,"S",44.666666666666671]
["Fabio",24,70,"S",43.333333333333329]
["Fabiola",16,106,"S",64.666666666666657]
["Fair Maiden",27,123,"S",18.25925925925926]
["Fairy Glamor",21,99,"D",43.19047619047619]
["Faith",19,101,"S",50.543859649122808]
["Faithful",18,61,"S",68.555555555555557]
["Falcon",19,80,"S",57.543859649122808]
["Falcor",15,93,"D",75.666666666666657]
["Falla",19,73,"S",59.877192982456137]
["Fallacy",24,66,"S",44.666666666666671]
["Falling Leaves",17,90,"S",64.117647058823536]
["Fame & Fortune",27,116,"D",20.592592592592592]
["Fancy",26,116,"D",22.871794871794869]
["Fancy Mover",22,71,"S",49.060606060606062]
["Fancy Pants",17,93,"D",63.117647058823529]
["Fancy Widow Maker",19,91,"S",53.877192982456137]
["Fancyface",21,63,"S",55.19047619047619]
["Fandango",17,78,"S",68.117647058823536]
["Fantasia",22,90,"S",42.727272727272727]
["Fantasy",17,111,"S",57.117647058823529]
["Fantsi",18,74,"S",64.222222222222229]
["Fanul",20,123,"D",39]
["Fara",19,78,"S",58.210526315789473]
["Faraway Kingdom",27,73,"S",34.925925925925924]
["Farnley",19,94,"S",52.877192982456137]
["Faruq",21,80,"S",49.523809523809526]
["Faster than Light",21,111,"D",39.19047619047619]
["Fasterthanu",24,96,"D",34.666666666666664]
["Fat Boy Slim",19,89,"S",54.543859649122808]
["Fat Chance Cinnamon",18,105,"D",53.888888888888886]
["Fawny",21,99,"D",43.19047619047619]
["Fay",19,77,"S",58.543859649122808]
["Fearghus",18,119,"D",49.222222222222221]
["Fearless Flames",20,79,"S",53.666666666666671]
["Feather",24,102,"D",32.666666666666664]
["Feather Canyon",19,97,"S",51.877192982456137]
["Feather Trader",17,81,"S",67.117647058823536]
["Feature Presentation",25,123,"S",23]
["Fedora",15,67,"S",84.333333333333329]
["Feels like gold",23,82,"S",42.231884057971016]
["Felena",25,76,"S",38.666666666666664]
["Felicity",17,72,"S",70.117647058823536]
["Feline",24,76,"S",41.333333333333329]
["Felix",21,65,"S",54.523809523809518]
["Felta",19,73,"S",59.877192982456137]
["Fencer",18,98,"D",56.222222222222221]
["Fergie",18,115,"S",50.555555555555557]
["Fergus",19,113,"D",46.543859649122808]
["Fern",21,79,"S",49.857142857142861]
["Ferngully",24,68,"S",44]
["Ferris",20,87,"S",51]
["Festive",22,77,"S",47.060606060606062]
["Festus",22,101,"D",39.060606060606062]
["Feuer Engel",17,111,"D",57.117647058823529]
["Fiddle Dee-Dee",15,97,"D",74.333333333333343]
["Fidget",15,104,"D",72]
["Fidler",19,92,"S",53.543859649122808]
["Fiesta",21,104,"D",41.523809523809518]
["Fight For Flash",16,84,"S",72]
["Figure Eight",19,83,"S",56.543859649122808]
["Filly",18,101,"S",55.222222222222221]
["Final Destination",27,84,"S",31.25925925925926]
["Final Episode",18,67,"S",66.555555555555557]
["Final Fantasy",24,82,"S",39.333333333333329]
["Finders Keepers",19,81,"S",57.210526315789473]
["Fine Design",20,112,"D",42.666666666666671]
["Fine 'n' Dandy",24,59,"S",47]
["Fine Tune",23,74,"S",44.89855072463768]
["Finnigan",23,74,"S",44.89855072463768]
["Fiona",19,120,"S",44.210526315789473]
["Fire",20,90,"S",50]
["Fire Ball",25,97,"S",31.666666666666664]
["Fire Balls",25,109,"S",27.666666666666664]
["Fire Foot",15,77,"S",81]
["Firebolt",18,115,"D",50.555555555555557]
["Firecracker",24,97,"D",34.333333333333336]
["Firefly",19,112,"D",46.877192982456137]
["Firenze",26,76,"S",36.205128205128204]
["Firey Devil",22,101,"S",39.060606060606062]
["First Class",17,76,"S",68.784313725490193]
["First Night",21,77,"S",50.523809523809526]
["First Rose",24,74,"S",42]
["First-Rate",17,72,"S",70.117647058823536]
["Fitz",16,68,"S",77.333333333333329]
["Five-Star",21,89,"S",46.523809523809526]
["Five-to-get-ready",19,99,"D",51.210526315789473]
["Fixious",16,65,"S",78.333333333333329]
["Fizz",25,67,"S",41.666666666666657]
["Flag",22,118,"S",33.393939393939391]
["Flagrant Delit",25,89,"S",34.333333333333336]
["Flamboyant Mistress",21,118,"D",36.857142857142861]
["Flame",24,67,"S",44.333333333333329]
["Flames",17,104,"S",59.450980392156858]
["Flaming Ace",22,68,"S",50.060606060606062]
["Flaming Glory",18,85,"S",60.555555555555557]
["Flaming Heart",20,75,"S",55]
["Flare",21,107,"D",40.523809523809518]
["Flare Extraordinaire",24,82,"S",39.333333333333329]
["Flash",20,87,"S",51]
["Flash By",21,92,"D",45.523809523809526]
["Flash in the Sky",18,104,"S",54.222222222222221]
["Flash of Light",19,89,"S",54.543859649122808]
["Flashdance",17,86,"S",65.450980392156865]
["Fleck of gold",23,86,"S",40.89855072463768]
["Fleet",21,103,"S",41.857142857142861]
["Fleet Goddess",18,79,"S",62.555555555555557]
["Fleet Street",22,93,"D",41.727272727272727]
["Flicka",22,97,"D",40.393939393939391]
["Flicker",22,113,"D",35.060606060606062]
["Flight Leader",26,73,"S",37.205128205128204]
["Flint",17,122,"S",53.450980392156858]
["Flipper",17,68,"S",71.450980392156865]
["Fliss",21,88,"S",46.857142857142861]
["Flopsy",27,70,"S",35.925925925925924]
["Florence",19,85,"S",55.877192982456137]
["Flower",19,90,"S",54.210526315789473]
["Floyd",21,95,"S",44.523809523809526]
["Flurry",25,60,"S",44]
["Fly Away",25,96,"D",32]
["Fly Me To The Moon",22,97,"S",40.393939393939391]
["Fly o Free",20,77,"S",54.333333333333329]
["Fly-By-Me",15,64,"S",85.333333333333329]
["Flyer",21,93,"S",45.19047619047619]
["Flyers Wing",19,90,"S",54.210526315789473]
["Flying Beauty",25,117,"S",25]
["Flying Colours",21,63,"S",55.19047619047619]
["Flying Expectations",19,112,"S",46.877192982456137]
["Flying Sparkels",20,90,"S",50]
["Flying Trapeze",19,82,"S",56.877192982456137]
["Flyte",20,70,"S",56.666666666666657]
["Folly",23,76,"S",44.231884057971016]
["Fonzie",27,91,"S",28.925925925925924]
["Footloose",27,66,"S",37.25925925925926]
["Footsie",18,63,"S",67.888888888888886]
["Foreign Affair",26,122,"D",20.871794871794876]
["Forest",17,90,"S",64.117647058823536]
["Forest Gump",19,75,"S",59.210526315789473]
["Forest Runner",22,78,"S",46.727272727272727]
["Forever Runner",22,101,"D",39.060606060606062]
["Forever Bliss",23,102,"S",35.565217391304351]
["Forte",24,70,"S",43.333333333333329]
["Fortunate",24,68,"S",44]
["Fortune Cookie",27,60,"S",39.25925925925926]
["Forty-four",26,75,"S",36.53846153846154]
["Foudre Rouge",20,121,"S",39.666666666666671]
["Four Leaf Clover",24,116,"D",28]
["Fox",22,89,"S",43.060606060606062]
["Fox Fire",15,66,"S",84.666666666666657]
["Fox Trot",20,63,"S",59]
["Foxtail",20,98,"D",47.333333333333329]
["Foxtrot",15,97,"S",74.333333333333343]
["Foxy",21,95,"D",44.523809523809526]
["Foxy Lady",25,63,"S",43]
["Frankie",17,72,"S",70.117647058823536]
["Franklin",20,75,"S",55]
["Freak",20,80,"S",53.333333333333329]
["Freaker",17,109,"S",57.784313725490208]
["Freckled Warrior",23,96,"S",37.565217391304344]
["Freckles",23,118,"D",30.231884057971023]
["Fred",15,89,"S",77]
["Freddie",20,75,"S",55]
["Freddy",26,69,"S",38.53846153846154]
["Free Verse",16,121,"D",59.666666666666664]
["Freedom",19,106,"D",48.877192982456137]
["Freedom's Call",18,95,"D",57.222222222222229]
["Freedoms Fire",26,95,"D",29.871794871794869]
["Freedoms Flame",23,76,"S",44.231884057971016]
["Freesia",22,76,"S",47.393939393939391]
["FreeZee",26,95,"D",29.871794871794869]
["Fresco",20,100,"S",46.666666666666671]
["Fressa",24,101,"S",33]
["Frezette",17,102,"D",60.117647058823529]
["Friday",25,100,"S",30.666666666666664]
["Frilly",24,101,"S",33]
["Frima",15,92,"S",76]
["Frimousse",26,61,"S",41.205128205128204]
["Frisco",24,62,"S",46]
["Frisky Whiskey",19,60,"S",64.21052631578948]
["Frith",22,123,"D",31.727272727272727]
["Frizzy-Liz",16,76,"S",74.666666666666671]
["Frodo",19,90,"S",54.210526315789473]
["Frolic",17,101,"S",60.450980392156858]
["Frosted",25,73,"S",39.666666666666664]
["Frosty",18,63,"S",67.888888888888886]
["FrostyJumper",22,91,"S",42.393939393939391]
["FrostyKing",26,71,"S",37.871794871794869]
["Frozen Motion",15,87,"S",77.666666666666657]
["Fudge",21,91,"S",45.857142857142854]
["Fuerte",19,107,"D",48.543859649122808]
["Furiette",22,100,"S",39.393939393939391]
["Fury",18,76,"S",63.555555555555557]
["Fuzzy",22,59,"S",53.060606060606062]
["G.B.F.(girls best friend)",15,105,"D",71.666666666666657]
["Gabriel",24,110,"S",29.999999999999996]
["Gadget",17,59,"S",74.450980392156865]
["Gage",22,82,"S",45.393939393939391]
["Gaia",17,92,"D",63.450980392156865]
["Gaiety",19,66,"S",62.210526315789473]
["Galactic Power",19,115,"D",45.877192982456137]
["Galadrial",17,96,"S",62.117647058823529]
["Galadrielle",22,101,"D",39.060606060606062]
["Galaxy",24,97,"S",34.333333333333336]
["Galaxy Girl",21,66,"S",54.19047619047619]
["Galaxy Quest",26,87,"S",32.53846153846154]
["Galino",26,82,"S",34.205128205128204]
["Galistic",21,92,"S",45.523809523809526]
["Gallagher",18,91,"S",58.555555555555557]
["Gallamist",22,87,"S",43.727272727272727]
["Gallant Lad",22,76,"S",47.393939393939391]
["Gallena",22,108,"D",36.727272727272727]
["Galloping Joy",15,81,"S",79.666666666666657]
["Gambit",25,67,"S",41.666666666666657]
["Gambit Springs",26,72,"S",37.53846153846154]
["Gameboy",22,107,"D",37.060606060606062]
["Gameel",17,90,"S",64.117647058823536]
["Gamin",24,106,"D",31.333333333333336]
["Gandolf",22,103,"D",38.393939393939391]
["Ganette",15,92,"S",76]
["Garnet",23,95,"S",37.89855072463768]
["Garris",19,61,"S",63.877192982456137]
["Gator",17,74,"S",69.450980392156865]
["Gatsby",15,76,"S",81.333333333333329]
["Gaucho",20,62,"S",59.333333333333343]
["Gayle",27,105,"S",24.25925925925926]
["Gazelle",23,85,"S",41.231884057971016]
["Geisha",22,60,"S",52.727272727272727]
["Gel Beri",19,107,"D",48.543859649122808]
["Gem",26,93,"D",30.53846153846154]
["Gem",20,73,"S",55.666666666666664]
["Gemini",24,81,"S",39.666666666666664]
["Gemma",22,95,"S",41.060606060606062]
["General",16,62,"S",79.333333333333329]
["General Comrade",25,88,"S",34.666666666666664]
["Geneviève",17,86,"S",65.450980392156865]
["Genie",27,87,"S",30.25925925925926]
["Genie in a Bodle",26,109,"S",25.205128205128212]
["Geno",26,79,"S",35.205128205128204]
["Gent",22,74,"S",48.060606060606062]
["Gentleman",21,86,"S",47.523809523809526]
["Gentleman Jazz",27,110,"D",22.592592592592588]
["Genuine Mastercard",22,78,"S",46.727272727272727]
["Genuine Risk",18,77,"S",63.222222222222229]
["Geoffrey",18,83,"S",61.222222222222229]
["George",18,74,"S",64.222222222222229]
["Georgia Clipper",20,106,"D",44.666666666666671]
["Georgie Girl",22,105,"D",37.727272727272727]
["Geri",22,73,"S",48.393939393939391]
["Geronimo",19,69,"S",61.210526315789473]
["Ghabriella",25,69,"S",41]
["Ghost",19,72,"S",60.210526315789473]
["Giddy up",22,106,"D",37.393939393939391]
["Giggles",24,65,"S",45]
["Gigi",23,121,"D",29.231884057971023]
["Gilly",23,61,"S",49.231884057971016]
["Gilthanas",24,80,"S",40]
["Gina",18,85,"S",60.555555555555557]
["Ginelle",25,71,"S",40.333333333333343]
["Ginger",25,80,"S",37.333333333333336]
["Ginger Rose",21,94,"D",44.857142857142854]
["Ginger Spice",27,72,"S",35.25925925925926]
["Gino",26,83,"S",33.871794871794869]
["Gizmo",15,114,"D",68.666666666666671]
["Glad Rags",20,63,"S",59]
["Glad Tidings",27,71,"S",35.592592592592595]
["Glass Slippers",24,100,"D",33.333333333333336]
["Glazing for me",24,108,"D",30.666666666666668]
["Glenmore Dixieland",23,67,"S",47.231884057971016]
["Glenmores Dancing Shoes",19,78,"S",58.210526315789473]
["Glimmers Magic Man",15,122,"D",66]
["Glorious",20,120,"D",40]
["Glory",22,85,"S",44.393939393939391]
["Glory Days",15,77,"S",81]
["Glow",19,107,"D",48.543859649122808]
["Glow N Ember",22,78,"S",46.727272727272727]
["Go Big",21,64,"S",54.857142857142861]
["Go for the Blue!",21,91,"S",45.857142857142854]
["Go for the Gold",24,93,"S",35.666666666666664]
["Go Snap",25,115,"S",25.666666666666664]
["Goddess",27,99,"D",26.25925925925926]
["Godfrey",21,90,"S",46.19047619047619]
["Godley Locks",17,91,"S",63.784313725490193]
["Godolphina",22,97,"D",40.393939393939391]
["GoGo",17,102,"S",60.117647058823529]
["Golactic",20,87,"S",51]
["Gold Dust",27,72,"S",35.25925925925926]
["Gold Jewel",19,90,"S",54.210526315789473]
["Gold leaf",19,76,"S",58.877192982456137]
["Gold Mine",22,100,"D",39.393939393939391]
["Gold Rush",26,101,"D",27.871794871794869]
["Gold Streak",27,108,"S",23.25925925925926]
["Golda",23,103,"D",35.231884057971023]
["Golda Mae",26,93,"D",30.53846153846154]
["Golden Cascade",15,84,"S",78.666666666666657]
["Golden Coin",19,78,"S",58.210526315789473]
["Golden Enchantment",16,110,"S",63.333333333333336]
["Golden Essence",20,79,"S",53.666666666666671]
["Golden Explorer",22,102,"S",38.727272727272727]
["Golden Eye",20,91,"S",49.666666666666671]
["Golden Fire",17,93,"S",63.117647058823529]
["Golden Girl",26,68,"S",38.871794871794869]
["Golden Glow",18,82,"S",61.555555555555557]
["Golden Grace",25,59,"S",44.333333333333329]
["Golden Heart",21,87,"S",47.19047619047619]
["Golden Jewel",22,93,"D",41.727272727272727]
["Golden Moon",18,121,"D",48.555555555555557]
["Golden Sand",15,123,"D",65.666666666666671]
["Golden Shamrock",24,99,"S",33.666666666666664]
["Goldfinger",21,59,"S",56.523809523809518]
["Goldie",24,76,"S",41.333333333333329]
["Goldmoon",25,78,"S",38]
["Goliath",24,95,"D",35]
["Gollum",22,71,"S",49.060606060606062]
["Golly",19,82,"S",56.877192982456137]
["Gomer",27,119,"S",19.592592592592592]
["Gonzo",27,90,"S",29.25925925925926]
["Good Golly Miss",22,60,"S",52.727272727272727]
["Good Luck Charm",22,87,"S",43.727272727272727]
["Good Man",26,81,"S",34.53846153846154]
["Good Son",22,84,"S",44.727272727272727]
["Good Sun",23,86,"S",40.89855072463768]
["Gorgeous",19,109,"D",47.877192982456137]
["Gothard",22,84,"S",44.727272727272727]
["Gotta-Go ",24,65,"S",45]
["Grace",17,83,"S",66.450980392156865]
["Grace Note",16,94,"S",68.666666666666671]
["Grace of an angel",21,61,"S",55.857142857142861]
["Graceland",24,71,"S",43]
["Gracie",27,74,"S",34.592592592592595]
["Grady",27,64,"S",37.925925925925924]
["Grafig",19,113,"D",46.543859649122808]
["Grand Illusion",27,92,"D",28.592592592592595]
["Grand Legend",24,91,"S",36.333333333333329]
["Grand Stand Man",24,100,"D",33.333333333333336]
["Grandvill",19,81,"S",57.210526315789473]
["Granny",26,72,"S",37.53846153846154]
["Graphic Design",19,61,"S",63.877192982456137]
["Gravy",19,97,"S",51.877192982456137]
["Greased Lightning",18,121,"S",48.555555555555557]
["Green Emerald",15,102,"S",72.666666666666657]
["Green Tea",16,96,"D",68]
["Grey Cloud",20,66,"S",58]
["Grin -N- Bear IT",21,99,"S",43.19047619047619]
["Gringo",16,93,"D",69]
["Grit's Secret Service",22,82,"S",45.393939393939391]
["Groovy",21,67,"S",53.857142857142861]
["Gucci",15,94,"S",75.333333333333329]
["Guess",16,96,"D",68]
["Guiness",27,96,"S",27.25925925925926]
["Gulliver",21,96,"S",44.19047619047619]
["Gumby",23,87,"S",40.565217391304344]
["Gummy Bear",22,65,"S",51.060606060606062]
["Gunner",23,89,"S",39.89855072463768]
["Gus",19,86,"S",55.543859649122808]
["Gusto",15,61,"S",86.333333333333329]
["Gusty",23,75,"S",44.565217391304344]
["Gypsy",20,99,"D",47]
["Gypsy Filly",18,97,"D",56.555555555555557]
["Gypsy King",20,87,"S",51]
["Gypsy Rose",22,65,"S",51.060606060606062]
["Gypsyfilea",22,93,"S",41.727272727272727]
["Haiku",21,73,"S",51.857142857142861]
["Hailey",22,81,"S",45.727272727272727]
["Hairy",20,75,"S",55]
["Hakka",15,69,"S",83.666666666666657]
["Hal",22,109,"S",36.393939393939391]
["Haley",21,90,"S",46.19047619047619]
["Haley's Comet",25,123,"D",23]
["Half Pint",20,81,"S",53]
["Hall",22,85,"S",44.393939393939391]
["Hally",15,123,"D",65.666666666666671]
["Hamilton",20,73,"S",55.666666666666664]
["Hamlet",20,97,"D",47.666666666666671]
["Han Solo",15,93,"D",75.666666666666657]
["Handy Man",22,92,"D",42.060606060606062]
["Hank",20,91,"S",49.666666666666671]
["Hanks Last Shot",26,86,"S",32.871794871794869]
["Hanna",20,77,"S",54.333333333333329]
["Hannah",19,117,"S",45.210526315789473]
["Hannsi",25,110,"D",27.333333333333336]
["Hansome",24,74,"S",42]
["Happenstance",23,96,"S",37.565217391304344]
["Happy",22,100,"D",39.393939393939391]
["Happy Appy",19,72,"S",60.210526315789473]
["Happy Daze",20,68,"S",57.333333333333343]
["Happy-Appy",19,91,"S",53.877192982456137]
["Hard on the Rocks",24,66,"S",44.666666666666671]
["Haribo",23,88,"S",40.231884057971016]
["Harley",24,84,"S",38.666666666666664]
["Harley Davidson",21,98,"S",43.523809523809518]
["Harmony",21,67,"S",53.857142857142861]
["Harold",26,103,"D",27.205128205128212]
["Harrison",19,59,"S",64.543859649122808]
["Harry",22,119,"D",33.060606060606062]
["Harvey",19,71,"S",60.543859649122808]
["Hasty",15,83,"S",79]
["Haughty",20,97,"D",47.666666666666671]
["Havenly Bandit",26,106,"D",26.205128205128212]
["Hawk",22,109,"S",36.393939393939391]
["Hawk of the Wind",22,59,"S",53.060606060606062]
["Hawken",15,119,"D",67]
["Hawkins",19,79,"S",57.877192982456137]
["Hazel",20,72,"S",56]
["Head Over Heels",22,101,"S",39.060606060606062]
["Heart",25,112,"D",26.666666666666664]
["Heart 'N Soul",16,70,"S",76.666666666666671]
["Heart of Stone",27,87,"S",30.25925925925926]
["Heart Stealer",20,117,"D",41]
["Heath",21,100,"D",42.857142857142861]
["Heather",16,69,"S",77]
["Heaven sent",22,96,"S",40.727272727272727]
["Heavenly angel",24,99,"D",33.666666666666664]
["Heavenly Dream",19,114,"S",46.210526315789473]
["Heavenly Prize",21,65,"S",54.523809523809518]
["Heavens Devil",19,101,"S",50.543859649122808]
["Heckle",20,70,"S",56.666666666666657]
["Height",22,82,"S",45.393939393939391]
["Hemlock",18,96,"D",56.888888888888886]
["Henry",21,98,"S",43.523809523809518]
["Henry Hudson",24,106,"S",31.333333333333336]
["Her Majesty",27,75,"S",34.25925925925926]
["Hera",27,92,"D",28.592592592592595]
["Hercules",27,75,"S",34.25925925925926]
["Herman",22,63,"S",51.727272727272727]
["Hermionie",24,92,"S",36]
["Hero",20,97,"D",47.666666666666671]
["Hershey",23,72,"S",45.565217391304344]
["Hershey's Kiss",25,111,"D",27]
["Hickory Hills Panosh",21,123,"S",35.19047619047619]
["Hidden Assets",19,75,"S",59.210526315789473]
["Hidden Dragon",22,95,"S",41.060606060606062]
["Hidden Treasure",24,90,"S",36.666666666666664]
["High Card",17,122,"D",53.450980392156858]
["High Court",25,84,"S",36]
["High Flyer",19,119,"D",44.543859649122808]
["High in the Sky",22,121,"S",32.393939393939391]
["High Plains Drifter",21,93,"D",45.19047619047619]
["High Sign",19,81,"S",57.210526315789473]
["High Voltage",21,82,"S",48.857142857142861]
["Higher Level",17,78,"S",68.117647058823536]
["Higher State",23,97,"S",37.231884057971023]
["High-Kountry",15,67,"S",84.333333333333329]
["Highland Glen Dougal",18,110,"S",52.222222222222221]
["Highlander",22,70,"S",49.393939393939391]
["Highlight",21,86,"S",47.523809523809526]
["HighTime Little Boy",22,84,"S",44.727272727272727]
["Highway Express",15,100,"D",73.333333333333343]
["Higness",17,123,"D",53.117647058823529]
["Hill Do It",21,102,"D",42.19047619047619]
["Hillview Irish Mist",22,73,"S",48.393939393939391]
["Hillview Suprise Packet",20,88,"S",50.666666666666671]
["Hip Mama",26,72,"S",37.53846153846154]
["Hippo",20,84,"S",52]
["Hlaivana",26,121,"S",21.205128205128201]
["Hobby",21,92,"D",45.523809523809526]
["Hobo",19,59,"S",64.543859649122808]
["Hocus",24,64,"S",45.333333333333329]
["Hocus Pocus",19,108,"D",48.210526315789473]
["Hogan",22,81,"S",45.727272727272727]
["Hola",23,96,"S",37.565217391304344]
["Hold your Horses",26,117,"D",22.53846153846154]
["Holly",18,76,"S",63.555555555555557]
["Holly Berry",25,103,"S",29.666666666666664]
["Holly Hill",16,78,"S",74]
["Holly Pooh",16,65,"S",78.333333333333329]
["Hollywood",22,66,"S",50.727272727272727]
["Hollywood Getaway",27,81,"S",32.25925925925926]
["Hollywood Shuffle",26,79,"S",35.205128205128204]
["Hollywood Star",20,83,"S",52.333333333333329]
["HollyWould Dunnit",16,79,"S",73.666666666666671]
["Homegirl",22,84,"S",44.727272727272727]
["Hometown Hero",15,81,"S",79.666666666666657]
["Homie",20,74,"S",55.333333333333336]
["Honest Broker",16,117,"S",61]
["Honey",24,70,"S",43.333333333333329]
["Honey Bear",23,65,"S",47.898550724637687]
["Honey Bee",17,95,"D",62.450980392156865]
["Honey Buns",18,71,"S",65.222222222222229]
["Hoof Prince",19,68,"S",61.543859649122808]
["Hooked on Onix",27,86,"S",30.592592592592595]
["Hop Skip 'n' a Jump",22,87,"S",43.727272727272727]
["Hope",22,75,"S",47.727272727272727]
["Hope's Rebellion",20,61,"S",59.666666666666657]
["Horse",17,119,"S",54.450980392156858]
["Hoshi",20,106,"D",44.666666666666671]
["Hoshi No Senshi (Warrior of the Stars)",26,63,"S",40.53846153846154]
["Hot Chocolate Chip",20,85,"S",51.666666666666671]
["Hot Expectations Fiasco",23,97,"D",37.231884057971023]
["Hot Gossip",22,95,"D",41.060606060606062]
["Hot Iron",24,85,"S",38.333333333333329]
["Hot Java",16,81,"S",73]
["Hot Rod",18,100,"S",55.555555555555557]
["Hot shot",16,70,"S",76.666666666666671]
["Hot Socks",19,71,"S",60.543859649122808]
["Hot Spot",22,61,"S",52.393939393939391]
["Hot Streak",21,77,"S",50.523809523809526]
["Hot Toddy",24,95,"S",35]
["HotJava",18,87,"S",59.888888888888886]
["Hotshot",27,99,"D",26.25925925925926]
["Houdini",16,95,"D",68.333333333333329]
["Houdon (beautiful ears in arabic)",21,74,"S",51.523809523809526]
["Houston",21,81,"S",49.19047619047619]
["Houston's Landing",22,65,"S",51.060606060606062]
["How Do You Like Me Now",25,62,"S",43.333333333333343]
["Howler",24,77,"S",41]
["Huckleberry",27,72,"S",35.25925925925926]
["Huey",18,82,"S",61.555555555555557]
["Hug Me Henry",21,66,"S",54.19047619047619]
["Hugo",22,71,"S",49.060606060606062]
["Hum",22,103,"S",38.393939393939391]
["Humble Glory",17,83,"S",66.450980392156865]
["Hummer",19,103,"D",49.877192982456137]
["Hummingbird",25,70,"S",40.666666666666657]
["Humphrey",23,78,"S",43.565217391304344]
["Hunter",18,92,"S",58.222222222222229]
["Hunter's Pride",15,62,"S",86]
["Hurricane Bay",18,86,"S",60.222222222222229]
["Hussy",22,84,"S",44.727272727272727]
["Hustle",18,102,"D",54.888888888888886]
["I Have a Dream",24,89,"S",37]
["I Kick Ass",20,68,"S",57.333333333333343]
["Iben",21,100,"D",42.857142857142861]
["Ibn",22,69,"S",49.727272727272727]
["Icabob",17,64,"S",72.784313725490193]
["Icarus",22,80,"S",46.060606060606062]
["Ice Cream",17,121,"D",53.7843137254902]
["Ice Cream Mix",21,90,"S",46.19047619047619]
["Ice Cube",26,77,"S",35.871794871794869]
["IceDrop",19,78,"S",58.210526315789473]
["Icefall",26,73,"S",37.205128205128204]
["Ichabod",20,62,"S",59.333333333333343]
["If Only",17,84,"S",66.117647058823536]
["Ike",19,69,"S",61.210526315789473]
["Ilio",22,70,"S",49.393939393939391]
["I'll be yer Huckleberry",20,94,"S",48.666666666666671]
["Illiad",19,106,"S",48.877192982456137]
["Illusion",21,88,"S",46.857142857142861]
["Ilona",22,69,"S",49.727272727272727]
["Im Cute N Cool",20,87,"S",51]
["I'm Double Secured",21,79,"S",49.857142857142861]
["Ima Cowboy Yes I Am",22,74,"S",48.060606060606062]
["Ima Golden Champagn",19,120,"D",44.210526315789473]
["Ima Hustler Baby",22,112,"D",35.393939393939391]
["Ima Perdy Lady",26,74,"S",36.871794871794869]
["Image",21,94,"S",44.857142857142854]
["Imagine",21,104,"D",41.523809523809518]
["Imagine That",25,70,"S",40.666666666666657]
["Immotal Flame",26,120,"S",21.53846153846154]
["Imogen",20,71,"S",56.333333333333343]
["Imogene",26,70,"S",38.205128205128204]
["Impossible",19,74,"S",59.543859649122808]
["Impossible Dream",19,97,"D",51.877192982456137]
["Impressive",21,93,"S",45.19047619047619]
["Imprintible",18,79,"S",62.555555555555557]
["In a tizzi",24,79,"S",40.333333333333329]
["In The Moonlight",19,86,"S",55.543859649122808]
["In The Spotlight",18,103,"S",54.555555555555557]
["In Your Dreams",15,69,"S",83.666666666666657]
["In Your Eyes",22,94,"D",41.393939393939391]
["Inca",20,90,"S",50]
["Inca Gold",19,105,"S",49.210526315789473]
["Indepth",15,113,"S",69]
["India",20,90,"S",50]
["Indian",21,71,"S",52.523809523809526]
["Indian Paint",17,76,"S",68.784313725490193]
["Indian Paintbrush",16,94,"D",68.666666666666671]
["Indiana (Jones)",22,71,"S",49.060606060606062]
["Indigo",22,63,"S",51.727272727272727]
["Indy",18,112,"S",51.555555555555557]
["Infatuation",25,63,"S",43]
["Inferno",20,59,"S",60.333333333333343]
["Inka",24,105,"S",31.666666666666668]
["Inky",15,83,"S",79]
["Inky Black",25,78,"S",38]
["Innocence",26,70,"S",38.205128205128204]
["Inspired Kiss",18,80,"S",62.222222222222229]
["Integrity's Promise",20,69,"S",57]
["Intense Suspense",22,107,"D",37.060606060606062]
["Intergalatitic",21,71,"S",52.523809523809526]
["International",19,113,"S",46.543859649122808]
["Interupted",22,120,"S",32.727272727272727]
["Into The Wind",19,88,"S",54.877192982456137]
["Intrigue",25,63,"S",43]
["Iola",23,79,"S",43.231884057971016]
["Iolanthe",20,118,"D",40.666666666666671]
["Iris Moon Glo",22,73,"S",48.393939393939391]
["Irish",21,97,"D",43.857142857142861]
["Irish mist",15,123,"D",65.666666666666671]
["Irish Song",21,79,"S",49.857142857142861]
["Iron Maiden",18,66,"S",66.888888888888886]
["Iroquois Lady",20,88,"S",50.666666666666671]
["Isaac",24,98,"D",34]
["Ishan",22,76,"S",47.393939393939391]
["Ishara (Arabic=Omen)",22,75,"S",47.727272727272727]
["Ishtar",22,122,"D",32.060606060606062]
["Isis",21,76,"S",50.857142857142861]
["Isn't She Something",21,104,"S",41.523809523809518]
["Isolde",21,72,"S",52.19047619047619]
["It Takes Two",22,82,"S",45.393939393939391]
["It's A Long Story",20,110,"S",43.333333333333329]
["Itsy Bitsy",17,82,"S",66.784313725490193]
["Ivan",15,82,"S",79.333333333333329]
["Ivory",21,85,"S",47.857142857142861]
["Ivy",21,81,"S",49.19047619047619]
["Ivy League",25,86,"S",35.333333333333336]
["Izzi",19,108,"S",48.210526315789473]
["Izzie",21,87,"S",47.19047619047619]
["Izzy",23,93,"D",38.565217391304344]
["Izzy Fine",18,86,"S",60.222222222222229]
["J.D. (Jack Daniels)",18,68,"S",66.222222222222229]
["Jack",23,75,"S",44.565217391304344]
["Jack",24,71,"S",43]
["Jack Daniels",22,103,"D",38.393939393939391]
["Jack Daniels Pride",20,92,"S",49.333333333333329]
["Jack Frost",20,94,"D",48.666666666666671]
["Jack of hearts",19,67,"S",61.877192982456137]
["Jack the Jumper",27,84,"S",31.25925925925926]
["Jackie",26,86,"S",32.871794871794869]
["Jackpot",20,121,"S",39.666666666666671]
["Jacky",19,101,"D",50.543859649122808]
["Jacob",27,69,"S",36.25925925925926]
["Jade",22,94,"D",41.393939393939391]
["Jag",18,78,"S",62.888888888888886]
["Jagajets",20,94,"D",48.666666666666671]
["Jaipur",18,88,"S",59.555555555555557]
["Jake",16,70,"S",76.666666666666671]
["Jalapeño",19,117,"S",45.210526315789473]
["Jameela (Arabic=Beautiful)",15,101,"S",73]
["James",24,90,"S",36.666666666666664]
["James Bond",23,122,"D",28.898550724637676]
["Jamie Lee Jet",19,70,"S",60.877192982456137]
["Jammer",24,63,"S",45.666666666666671]
["Jamocha",23,85,"S",41.231884057971016]
["Jana",22,71,"S",49.060606060606062]
["Jantana ,",18,59,"S",69.222222222222229]
["Jasmine",19,63,"S",63.210526315789473]
["Jason",21,102,"D",42.19047619047619]
["Jasper",23,85,"S",41.231884057971016]
["Java",16,84,"S",72]
["Javen",23,104,"D",34.898550724637673]
["Jay jay",21,78,"S",50.19047619047619]
["Jazz",20,99,"S",47]
["Jazz Dancer",26,97,"D",29.205128205128212]
["Jazz It Up",18,72,"S",64.888888888888886]
["Jazzman",15,84,"S",78.666666666666657]
["Jazzstar",25,89,"S",34.333333333333336]
["Jazzy",19,59,"S",64.543859649122808]
["Jazzy Lady",19,91,"S",53.877192982456137]
["Jedi Knight",21,71,"S",52.523809523809526]
["Jeep",19,85,"S",55.877192982456137]
["Jelly",16,86,"S",71.333333333333329]
["Jellybean",21,82,"S",48.857142857142861]
["Jellybelly",22,66,"S",50.727272727272727]
["Jenny",19,81,"S",57.210526315789473]
["Jesse",15,99,"D",73.666666666666657]
["Jessica",21,71,"S",52.523809523809526]
["Jessie",26,69,"S",38.53846153846154]
["Jessie Girl",18,87,"S",59.888888888888886]
["Jessie James",16,84,"S",72]
["Jester",20,96,"S",48]
["Jet",18,105,"S",53.888888888888886]
["Jet Stream",16,81,"S",73]
["Jetter",21,93,"S",45.19047619047619]
["Jettie",24,109,"D",30.333333333333336]
["Jewel",20,123,"D",39]
["Jewelclaw",20,85,"S",51.666666666666671]
["Jewell",21,105,"D",41.19047619047619]
["Jezzabelle",18,83,"S",61.222222222222229]
["Jigga",20,89,"S",50.333333333333329]
["Jigger",19,120,"S",44.210526315789473]
["JigSaw",19,98,"D",51.543859649122808]
["Jigsy",26,85,"S",33.205128205128204]
["Jill",22,94,"S",41.393939393939391]
["Jillian",22,104,"S",38.060606060606062]
["Jim Dandy",16,123,"S",59]
["Jimbo",25,76,"S",38.666666666666664]
["Jim-bob McKeown",25,111,"D",27]
["Jiminy cricket",17,98,"S",61.450980392156858]
["Jimmy",20,69,"S",57]
["Jingles",17,97,"S",61.784313725490208]
["Jingo",21,102,"S",42.19047619047619]
["Jinx",25,86,"S",35.333333333333336]
["Jitter Bug",24,71,"S",43]
["Jitters",20,74,"S",55.333333333333336]
["Jo",16,97,"S",67.666666666666657]
["Jodami",23,95,"S",37.89855072463768]
["Jodi",21,76,"S",50.857142857142861]
["Jody",25,61,"S",43.666666666666671]
["Joe Spot",18,72,"S",64.888888888888886]
["Joey",23,123,"D",28.565217391304348]
["John",15,62,"S",86]
["John Cash",23,90,"S",39.565217391304344]
["Johnny",27,84,"S",31.25925925925926]
["Johnnys Angel",24,97,"D",34.333333333333336]
["JoJo",25,73,"S",39.666666666666664]
["Joker",22,102,"S",38.727272727272727]
["Jolie",22,113,"D",35.060606060606062]
["Jonas",23,93,"S",38.565217391304344]
["Jonathan",22,115,"D",34.393939393939391]
["Josef",23,63,"S",48.565217391304344]
["Josephine",20,69,"S",57]
["Joshua Mountain Miracle",25,63,"S",43]
["Joss",22,102,"D",38.727272727272727]
["Joy",19,88,"S",54.877192982456137]
["Joyride",19,95,"D",52.543859649122808]
["Jubilee",21,113,"D",38.523809523809518]
["Judo",21,105,"D",41.19047619047619]
["Jules",19,102,"D",50.210526315789473]
["Julie",21,70,"S",52.857142857142861]
["Juliet",19,109,"S",47.877192982456137]
["Jumbo",18,98,"D",56.222222222222221]
["Jumper",19,113,"S",46.543859649122808]
["Jumping For Joy",20,62,"S",59.333333333333343]
["Jumping Jack",18,90,"S",58.888888888888886]
["Jumping Jester",15,90,"S",76.666666666666657]
["Jumping to Conclusions",15,110,"S",70]
["Jumpstart",22,71,"S",49.060606060606062]
["June",19,79,"S",57.877192982456137]
["Junebug",16,73,"S",75.666666666666671]
["Jungle Prince",20,63,"S",59]
["Junior",22,90,"S",42.727272727272727]
["Juniper",20,111,"D",43]
["Juno",20,115,"S",41.666666666666671]
["Jupiter",17,83,"S",66.450980392156865]
["Jus de Pomme",17,95,"D",62.450980392156865]
["Just a Brat",17,89,"S",64.450980392156865]
["Just a Breeze",21,76,"S",50.857142857142861]
["Just a Dream",25,86,"S",35.333333333333336]
["Just a Flirt",22,71,"S",49.060606060606062]
["Just Because",20,62,"S",59.333333333333343]
["Just Between Us",25,59,"S",44.333333333333329]
["Just Got Zipped",19,72,"S",60.210526315789473]
["Just In Time",15,72,"S",82.666666666666657]
["Just Joe",22,76,"S",47.393939393939391]
["Just My Style",25,113,"D",26.333333333333336]
["Just N Time",16,107,"D",64.333333333333343]
["Just one Kiss",22,113,"S",35.060606060606062]
["Just the 2 of us",21,85,"S",47.857142857142861]
["Just Victory",20,100,"D",46.666666666666671]
["Just William",20,69,"S",57]
["Justin",21,97,"D",43.857142857142861]
["Kachina",20,71,"S",56.333333333333343]
["Kacie",26,86,"S",32.871794871794869]
["Kaddilac Jack",19,87,"S",55.210526315789473]
["Kagney",21,74,"S",51.523809523809526]
["Kahli",24,122,"D",26]
["Kahlua",16,69,"S",77]
["Kahuna",22,94,"S",41.393939393939391]
["Kaine",25,77,"S",38.333333333333336]
["Kalahari",20,93,"S",49]
["Kalika",18,85,"S",60.555555555555557]
["Kalina",20,79,"S",53.666666666666671]
["Kalita",18,99,"D",55.888888888888886]
["Kalli",21,78,"S",50.19047619047619]
["Kalondra",15,70,"S",83.333333333333329]
["Kalua",15,115,"S",68.333333333333343]
["Kalypso",17,95,"D",62.450980392156865]
["Kar Kalim",24,80,"S",40]
["Kara",21,97,"D",43.857142857142861]
["Karana",15,93,"D",75.666666666666657]
["Karisha",21,95,"S",44.523809523809526]
["Karma",20,116,"S",41.333333333333329]
["Kashmire",16,80,"S",73.333333333333329]
["Kasimira",19,92,"D",53.543859649122808]
["Kasmir",20,91,"S",49.666666666666671]
["Katabatic",21,77,"S",50.523809523809526]
["Katareena",27,93,"S",28.25925925925926]
["Katelynn",24,60,"S",46.666666666666671]
["Katie",23,111,"S",32.565217391304344]
["Katifa",18,93,"D",57.888888888888886]
["Kayla",23,85,"S",41.231884057971016]
["Kaylab",27,66,"S",37.25925925925926]
["Kayleigh",22,101,"D",39.060606060606062]
["Keela",15,108,"D",70.666666666666657]
["Keenashaw",21,90,"S",46.19047619047619]
["Keener Than Keen",21,80,"S",49.523809523809526]
["Keep Sake",25,71,"S",40.333333333333343]
["Keeta",19,72,"S",60.210526315789473]
["Kei",21,69,"S",53.19047619047619]
["Keisha",22,93,"D",41.727272727272727]
["Keldoron",21,114,"D",38.19047619047619]
["Kellendria",16,115,"D",61.666666666666664]
["Kelly",19,69,"S",61.210526315789473]
["Kelly Cann",20,110,"D",43.333333333333329]
["Kelly Green",19,119,"D",44.543859649122808]
["Kelpie",19,80,"S",57.543859649122808]
["Kelty",19,90,"S",54.210526315789473]
["Kelvin",21,60,"S",56.19047619047619]
["Kemill Hill Tinka",22,74,"S",48.060606060606062]
["Kenda",19,102,"D",50.210526315789473]
["Keno",18,86,"S",60.222222222222229]
["Kenshi (japanese for sword saint)",18,62,"S",68.222222222222229]
["Kentucky Morning",22,100,"D",39.393939393939391]
["Kentucky Roses",24,81,"S",39.666666666666664]
["Kepell Meister",22,71,"S",49.060606060606062]
["Kept Secret",22,78,"S",46.727272727272727]
["Kermit",25,90,"S",34]
["Kesha",20,96,"D",48]
["Kestral",17,79,"S",67.784313725490193]
["Kevah",24,114,"S",28.666666666666664]
["Kez",17,69,"S",71.117647058823536]
["Khan",22,93,"D",41.727272727272727]
["Kiawa",20,72,"S",56]
["Kilburn's Boy",17,73,"S",69.784313725490193]
["Killian",16,100,"D",66.666666666666657]
["King",20,92,"D",49.333333333333329]
["King Concert",23,114,"D",31.565217391304348]
["King of Kings",20,104,"D",45.333333333333329]
["King Quakers crystal",21,70,"S",52.857142857142861]
["Kinger",17,92,"S",63.450980392156865]
["King's Prize aka Freddie",20,85,"S",51.666666666666671]
["Kings Ransom",20,123,"S",39]
["Kingston",26,113,"D",23.871794871794869]
["Kip",20,93,"S",49]
["Kipawa",21,80,"S",49.523809523809526]
["Kipper",20,94,"D",48.666666666666671]
["Kira",22,66,"S",50.727272727272727]
["Kirby",16,79,"S",73.666666666666671]
["Kisha",16,97,"D",67.666666666666657]
["Kismet",18,88,"S",59.555555555555557]
["Kiss",23,59,"S",49.898550724637687]
["Kiss and Tell",21,92,"S",45.523809523809526]
["Kiss em and Leave em",18,84,"S",60.888888888888886]
["Kiss Me Clown",23,86,"S",40.89855072463768]
["Kiss me Kate",21,116,"S",37.523809523809518]
["Kiss my Zip",22,88,"S",43.393939393939391]
["Kissin the Sky",20,80,"S",53.333333333333329]
["Kit",27,85,"S",30.925925925925924]
["Kit Kat",16,87,"S",71]
["Kit Kat's Chat",25,89,"S",34.333333333333336]
["Kitana",19,82,"S",56.877192982456137]
["Kitty",22,118,"D",33.393939393939391]
["Kitty Hawk",20,94,"D",48.666666666666671]
["Kiwi",19,104,"S",49.543859649122808]
["Kix",22,121,"D",32.393939393939391]
["Kizi",24,66,"S",44.666666666666671]
["Kizmit",19,68,"S",61.543859649122808]
["Kizzy",19,114,"D",46.210526315789473]
["Knight",20,70,"S",56.666666666666657]
["Knock Your Socks Off",24,103,"S",32.333333333333336]
["Ko Jax",23,104,"S",34.898550724637673]
["Kochiese",25,74,"S",39.333333333333336]
["Kodak",26,73,"S",37.205128205128204]
["Kodak Moment",20,82,"S",52.666666666666671]
["Kodiak",19,99,"S",51.210526315789473]
["Kodie",16,66,"S",78]
["Koko",19,82,"S",56.877192982456137]
["Koopy",22,104,"S",38.060606060606062]
["Kossaka ",17,86,"S",65.450980392156865]
["Kotege",20,123,"S",39]
["Kramer",22,83,"S",45.060606060606062]
["Kravitz",18,73,"S",64.555555555555557]
["Krest",18,90,"S",58.888888888888886]
["Kricket",21,90,"S",46.19047619047619]
["Kriptonite",18,62,"S",68.222222222222229]
["Kroner",20,67,"S",57.666666666666657]
["Krugerrand",25,101,"D",30.333333333333336]
["Kryptonite",15,81,"S",79.666666666666657]
["Krystal",19,69,"S",61.210526315789473]
["Kylie",21,99,"D",43.19047619047619]
["Kystie",19,81,"S",57.210526315789473]
["La Primavera",21,99,"D",43.19047619047619]
["Lace",26,119,"D",21.871794871794876]
["Lacey",22,86,"S",44.060606060606062]
["Lacy",19,70,"S",60.877192982456137]
["Lad",25,116,"S",25.333333333333336]
["Ladd",22,99,"S",39.727272727272727]
["Laddie",17,83,"S",66.450980392156865]
["Lady",22,79,"S",46.393939393939391]
["Lady Ameera ",17,87,"S",65.117647058823536]
["Lady Americo",18,100,"D",55.555555555555557]
["Lady Blackstar",21,82,"S",48.857142857142861]
["Lady Blue Eyes",16,116,"D",61.333333333333336]
["Lady Boots",27,113,"D",21.592592592592592]
["Lady Carlotta",19,61,"S",63.877192982456137]
["Lady Cinnabar",24,78,"S",40.666666666666664]
["Lady Estella",17,105,"S",59.117647058823529]
["Lady Hawk",23,65,"S",47.898550724637687]
["Lady Leggs",15,72,"S",82.666666666666657]
["Lady Madonna",21,69,"S",53.19047619047619]
["Lady of Lanarkshire",27,98,"D",26.592592592592588]
["LadyBug",21,76,"S",50.857142857142861]
["Lady's Man",23,100,"D",36.231884057971023]
["Lady's Mist",27,107,"D",23.592592592592588]
["Lady's Sundancer",15,108,"D",70.666666666666657]
["Lahja-Viktoria",25,74,"S",39.333333333333336]
["Lakota",23,92,"S",38.89855072463768]
["Lamal",17,108,"D",58.117647058823529]
["Lana",24,105,"D",31.666666666666668]
["Lanai",15,121,"S",66.333333333333343]
["Lancelot",18,99,"S",55.888888888888886]
["Landslide",19,105,"D",49.210526315789473]
["Langers Tequila",25,77,"S",38.333333333333336]
["Lantana Lady",19,59,"S",64.543859649122808]
["Lardeo",21,62,"S",55.523809523809518]
["Lashka",19,92,"S",53.543859649122808]
["Lass",20,74,"S",55.333333333333336]
["Last Man Standing",21,61,"S",55.857142857142861]
["Latara",25,74,"S",39.333333333333336]
["Laura Ashley",16,89,"S",70.333333333333329]
["Lauralanthalasa",18,63,"S",67.888888888888886]
["Lava",15,102,"D",72.666666666666657]
["Lavender Sky",26,95,"S",29.871794871794869]
["Lavigne",22,98,"D",40.060606060606062]
["Layali (night)",16,67,"S",77.666666666666671]
["Layla",22,72,"S",48.727272727272727]
["Lazy red",23,76,"S",44.231884057971016]
["Lea",27,79,"S",32.925925925925924]
["Leap of Faith",19,100,"D",50.877192982456137]
["Leather'n'Lace",15,74,"S",82]
["Leave it to me",25,86,"S",35.333333333333336]
["Ledger",27,88,"S",29.925925925925924]
["Lee Diamond",26,72,"S",37.53846153846154]
["Lefroy Ailin Dwane",21,93,"S",45.19047619047619]
["Lefty",24,112,"D",29.333333333333336]
["Legacy",16,73,"S",75.666666666666671]
["Legend",27,98,"D",26.592592592592588]
["Legend of Zelda",17,77,"S",68.450980392156865]
["Legendary Warcry",19,117,"S",45.210526315789473]
["Legs",16,92,"D",69.333333333333329]
["Lena",17,96,"D",62.117647058823529]
["Lenny",22,83,"S",45.060606060606062]
["Leo",27,82,"S",31.925925925925924]
["Leon",19,92,"S",53.543859649122808]
["Leonardo",23,98,"D",36.898550724637673]
["Lesley",19,95,"D",52.543859649122808]
["Lestat",25,82,"S",36.666666666666664]
["Let's Ride",21,103,"D",41.857142857142861]
["Level",22,85,"S",44.393939393939391]
["Levi",23,74,"S",44.89855072463768]
["Lex",21,64,"S",54.857142857142861]
["Lexi",22,60,"S",52.727272727272727]
["Lextus",21,91,"S",45.857142857142854]
["Lexus",23,122,"S",28.898550724637676]
["Liberty",23,86,"S",40.89855072463768]
["Libertys Ride",21,81,"S",49.19047619047619]
["Libra",19,80,"S",57.543859649122808]
["Lickety Split",20,94,"D",48.666666666666671]
["Licorice",20,73,"S",55.666666666666664]
["Liferoot",23,102,"D",35.565217391304351]
["Light",19,98,"S",51.543859649122808]
["Light the Night",23,102,"D",35.565217391304351]
["Light the Way",22,62,"S",52.060606060606062]
["Lightening",26,89,"S",31.871794871794869]
["Lightning",20,66,"S",58]
["Lightning James Bond",27,83,"S",31.592592592592595]
["Lika Whisper",19,87,"S",55.210526315789473]
["Lil' Doll",15,122,"S",66]
["Lil Miss Mysterious",18,71,"S",65.222222222222229]
["Lil Sugar",21,96,"D",44.19047619047619]
["Lilbit",15,94,"S",75.333333333333329]
["Lillie",23,101,"S",35.898550724637673]
["Lilly",21,82,"S",48.857142857142861]
["Lilly Bing",22,59,"S",53.060606060606062]
["Lily",16,102,"S",66]
["Lily-of-the-Valley",25,89,"S",34.333333333333336]
["Limelight",25,87,"S",35]
["Limited Edition",22,82,"S",45.393939393939391]
["Limitless Time",20,92,"D",49.333333333333329]
["Lincoln",17,102,"D",60.117647058823529]
["Lincoln's Copper Penny",21,98,"S",43.523809523809518]
["Linda",24,110,"D",29.999999999999996]
["Lindsay",20,98,"S",47.333333333333329]
["Linus",27,118,"D",19.925925925925927]
["Lio",27,83,"S",31.592592592592595]
["Lippy",16,91,"S",69.666666666666671]
["Lisa",26,123,"D",20.53846153846154]
["Little Barney",19,71,"S",60.543859649122808]
["Little Bay Lady",26,94,"D",30.205128205128208]
["Little Bit",20,82,"S",52.666666666666671]
["Little bit of Spice",26,72,"S",37.53846153846154]
["Little Bits",15,113,"S",69]
["Little Boy Blue",20,83,"S",52.333333333333329]
["Little Chief White Cloud",26,106,"S",26.205128205128212]
["Little Commet",25,83,"S",36.333333333333336]
["Little Creamer",21,60,"S",56.19047619047619]
["Little Extra Credit",21,97,"D",43.857142857142861]
["Little Joe",22,64,"S",51.393939393939391]
["Little Joe Brick",21,110,"D",39.523809523809518]
["Little Lady",20,80,"S",53.333333333333329]
["Little Love",27,73,"S",34.925925925925924]
["Little Lunik",24,103,"D",32.333333333333336]
["Little Man",16,81,"S",73]
["Little Miss English Muffin",26,109,"S",25.205128205128212]
["Little Miss Patriot",20,81,"S",53]
["Little Patric",17,70,"S",70.784313725490193]
["Little Rose Nakita",23,82,"S",42.231884057971016]
["Lizzy",21,117,"D",37.19047619047619]
["Loco",22,93,"S",41.727272727272727]
["Locomotion",22,119,"S",33.060606060606062]
["Lofty",23,85,"S",41.231884057971016]
["Logan",24,89,"S",37]
["Logo",18,94,"S",57.555555555555557]
["Lolita",19,81,"S",57.210526315789473]
["Lonesome Glory",19,76,"S",58.877192982456137]
["Long Lost",21,92,"D",45.523809523809526]
["Look At me Go",20,83,"S",52.333333333333329]
["Loose Change",25,109,"S",27.666666666666664]
["Loran",21,71,"S",52.523809523809526]
["Lord Stars",17,86,"S",65.450980392156865]
["Lord York",20,69,"S",57]
["Lords King William",22,111,"S",35.727272727272727]
["Lorenzo",20,84,"S",52]
["Lothario",17,88,"S",64.784313725490193]
["Lottie",26,89,"S",31.871794871794869]
["Lottie Da",19,61,"S",63.877192982456137]
["Lotto",21,82,"S",48.857142857142861]
["Lotus",24,95,"D",35]
["Louis",21,81,"S",49.19047619047619]
["Louis D'Aragon",22,64,"S",51.393939393939391]
["Lovely",19,85,"S",55.877192982456137]
["Lover Boy",19,104,"D",49.543859649122808]
["Love's Verse",21,89,"S",46.523809523809526]
["Ltiff",24,63,"S",45.666666666666671]
["Lucifer",20,79,"S",53.666666666666671]
["Luck of the Irish",17,60,"S",74.117647058823536]
["Lucky",21,100,"S",42.857142857142861]
["Lucky Charm",25,97,"S",31.666666666666664]
["Lucky Charm'z",15,99,"S",73.666666666666657]
["Lucky Lotto Lad",20,72,"S",56]
["Lucky Shamrock",25,86,"S",35.333333333333336]
["Lucky Star",26,96,"S",29.53846153846154]
["Lucky's Chance",19,121,"S",43.877192982456137]
["Lucky's Charm",16,118,"D",60.666666666666664]
["Lucky's Second chance",19,85,"S",55.877192982456137]
["Luckystars",24,103,"D",32.333333333333336]
["Lúcra",19,60,"S",64.21052631578948]
["Lucy",19,73,"S",59.877192982456137]
["Ludwig",25,101,"S",30.333333333333336]
["Lugano",20,101,"D",46.333333333333329]
["Lullaby Maker",25,83,"S",36.333333333333336]
["Luna",26,74,"S",36.871794871794869]
["Luna",22,68,"S",50.060606060606062]
["Lunar Eclipse",20,71,"S",56.333333333333343]
["Lunatic",20,80,"S",53.333333333333329]
["Lune de miel (French=Honeymoon)",18,93,"D",57.888888888888886]
["Lurch",15,77,"S",81]
["M&M",20,84,"S",52]
["Mac",19,119,"D",44.543859649122808]
["Mackenzie",19,94,"D",52.877192982456137]
["Macleod",15,71,"S",83]
["Macy",21,91,"S",45.857142857142854]
["Madam Pixi",16,117,"D",61]
["Madame Butterfly",25,61,"S",43.666666666666671]
["Maddie",21,64,"S",54.857142857142861]
["Maddison",26,82,"S",34.205128205128204]
["Maddy",21,90,"S",46.19047619047619]
["Made Of Honor",20,77,"S",54.333333333333329]
["Made You Look",20,69,"S",57]
["Madison",22,87,"S",43.727272727272727]
["Madison Avenue",23,61,"S",49.231884057971016]
["Madonna",21,59,"S",56.523809523809518]
["Maestro",21,74,"S",51.523809523809526]
["Magavin",16,115,"D",61.666666666666664]
["Magee",27,69,"S",36.25925925925926]
["Magestic",20,92,"D",49.333333333333329]
["Maggie",21,121,"S",35.857142857142861]
["Maggie May",17,79,"S",67.784313725490193]
["Maggie's Maiden",21,123,"D",35.19047619047619]
["Magic",15,83,"S",79]
["Magic At Last",15,95,"D",75]
["Magic Carpet",24,90,"S",36.666666666666664]
["Magic Night",22,64,"S",51.393939393939391]
["Magic Star Pusher",22,91,"S",42.393939393939391]
["Magic Touch",15,90,"S",76.666666666666657]
["Magnum",15,82,"S",79.333333333333329]
["Magoo",25,94,"S",32.666666666666664]
["Maid Marion",21,82,"S",48.857142857142861]
["Maid of Silver",15,93,"S",75.666666666666657]
["Maiden",17,95,"S",62.450980392156865]
["Maiko",21,65,"S",54.523809523809518]
["Maisie",21,81,"S",49.19047619047619]
["Majeed",22,67,"S",50.393939393939391]
["Majestic Majesty",16,116,"D",61.333333333333336]
["Majestic Wind",22,68,"S",50.060606060606062]
["Majesty",21,77,"S",50.523809523809526]
["Major",22,97,"S",40.393939393939391]
["Make me a star",22,96,"D",40.727272727272727]
["Malachite",22,93,"S",41.727272727272727]
["Malcolm",19,87,"S",55.210526315789473]
["Malibu",20,99,"D",47]
["Malikhi",18,75,"S",63.888888888888886]
["Manchego",21,71,"S",52.523809523809526]
["Mandolin",21,113,"D",38.523809523809518]
["Mandy",19,98,"D",51.543859649122808]
["Mango Maddness",21,99,"D",43.19047619047619]
["Mania",19,60,"S",64.21052631578948]
["Mankala",16,74,"S",75.333333333333329]
["Manly",22,88,"S",43.393939393939391]
["Manolito",19,102,"D",50.210526315789473]
["Maple Syrup",19,83,"S",56.543859649122808]
["Marama",20,100,"D",46.666666666666671]
["Maranda",15,92,"D",76]
["Marbach",20,85,"S",51.666666666666671]
["March to Victory",22,82,"S",45.393939393939391]
["Marcie",25,65,"S",42.333333333333343]
["Marcus",19,98,"D",51.543859649122808]
["Marengo",22,86,"S",44.060606060606062]
["Margo",25,106,"D",28.666666666666664]
["Maria",22,104,"D",38.060606060606062]
["Marigold",22,96,"D",40.727272727272727]
["Marion",15,102,"D",72.666666666666657]
["Marisa",27,65,"S",37.592592592592595]
["Mark",16,81,"S",73]
["Marks Super Socks",23,81,"S",42.565217391304344]
["Marlett",15,85,"S",78.333333333333329]
["Marley",15,115,"D",68.333333333333343]
["Marquisse",27,84,"S",31.25925925925926]
["Mars",24,78,"S",40.666666666666664]
["Marshall Skipper Bar",19,95,"D",52.543859649122808]
["Marshmallow",18,69,"S",65.888888888888886]
["Marshmello",21,75,"S",51.19047619047619]
["Marshy",21,118,"D",36.857142857142861]
["Martini",22,119,"S",33.060606060606062]
["Marvin",26,69,"S",38.53846153846154]
["Marvin Bay",27,115,"S",20.925925925925927]
["Mary",17,89,"S",64.450980392156865]
["Mary Mary quite Contrary",24,95,"S",35]
["MaryJane",15,80,"S",80]
["MaryJanes Last Dance",18,81,"S",61.888888888888886]
["MaryLou",20,89,"S",50.333333333333329]
["Masimo ",24,89,"S",37]
["Mastang Sally",21,86,"S",47.523809523809526]
["Master Mind",24,92,"D",36]
["Master Oats",25,60,"S",44]
["Master Piece",26,83,"S",33.871794871794869]
["Master Pluto",15,87,"S",77.666666666666657]
["Master Teddy Edward",24,122,"D",26]
["MaTao ",20,78,"S",54]
["Matica",27,101,"S",25.592592592592588]
["Matilda",26,102,"S",27.53846153846154]
["Matrix",24,84,"S",38.666666666666664]
["Mattawa",25,95,"D",32.333333333333336]
["Matter of Heart",22,94,"D",41.393939393939391]
["Mattimeo",19,85,"S",55.877192982456137]
["Maude",25,87,"S",35]
["Mauharina",20,95,"D",48.333333333333329]
["Maverick",17,100,"S",60.784313725490208]
["Max",15,92,"D",76]
["Maximotion",25,74,"S",39.333333333333336]
["Maxine",16,89,"S",70.333333333333329]
["May",17,88,"S",64.784313725490193]
["May Day",25,101,"D",30.333333333333336]
["Maya",23,90,"S",39.565217391304344]
["Mayday",20,95,"D",48.333333333333329]
["Mayzie Day",25,108,"D",28]
["Mazey",19,89,"S",54.543859649122808]
["McCloud",15,86,"S",78]
["McKenna",22,108,"D",36.727272727272727]
["Meadow Skipper",16,87,"S",71]
["Medal of Freedom",26,105,"D",26.53846153846154]
["Medley",27,95,"D",27.592592592592595]
["Meeka",18,100,"D",55.555555555555557]
["Megaboom",20,117,"D",41]
["Megabucks",20,63,"S",59]
["Megan",18,74,"S",64.222222222222229]
["Megan's Craker",20,80,"S",53.333333333333329]
["Melissa",20,109,"S",43.666666666666671]
["Mellie",16,72,"S",76]
["Mello Yello",21,76,"S",50.857142857142861]
["Mellow Morrick",21,86,"S",47.523809523809526]
["Mellow Yellow",21,108,"S",40.19047619047619]
["Melody",25,80,"S",37.333333333333336]
["Melt Away",17,92,"D",63.450980392156865]
["Memory",21,101,"S",42.523809523809518]
["Mercedes",23,107,"S",33.898550724637673]
["Mercury",19,64,"S",62.877192982456137]
["Mercy",15,108,"S",70.666666666666657]
["Merietta",25,71,"S",40.333333333333343]
["Merlin",22,109,"S",36.393939393939391]
["Merlin's Magic",15,111,"S",69.666666666666657]
["Mermaid",16,92,"S",69.333333333333329]
["Merrick",27,102,"S",25.25925925925926]
["Merrie",19,84,"S",56.210526315789473]
["Merry Legs",20,61,"S",59.666666666666657]
["Merrylegs",19,89,"S",54.543859649122808]
["Merrylegs",22,123,"D",31.727272727272727]
["Merry-weather",25,76,"S",38.666666666666664]
["Mexican Treat",16,75,"S",75]
["Mia",17,82,"S",66.784313725490193]
["Miami Vice",25,93,"D",33]
["Mica",20,100,"D",46.666666666666671]
["Mickey",26,89,"S",31.871794871794869]
["Mickey Blue Eyes",24,116,"D",28]
["Micro Mini",20,65,"S",58.333333333333343]
["Mid Mornings Light Breeze",18,112,"D",51.555555555555557]
["Midge",27,79,"S",32.925925925925924]
["Midnight",24,81,"S",39.666666666666664]
["Midnight April Moon",19,76,"S",58.877192982456137]
["Midnight Blues",25,91,"S",33.666666666666664]
["Midnight Clear",19,87,"S",55.210526315789473]
["Midnight Dancer",25,61,"S",43.666666666666671]
["Midnight Dream",25,70,"S",40.666666666666657]
["Midnight Dreamer",20,119,"S",40.333333333333329]
["Midnight Express",25,96,"D",32]
["Midnight Jewel",15,119,"S",67]
["Midnight Lady",15,96,"S",74.666666666666657]
["Midnight Legacy",21,64,"S",54.857142857142861]
["Midnight Madness",22,102,"S",38.727272727272727]
["Midnight Magic",21,90,"S",46.19047619047619]
["Midnight Majesty",25,106,"D",28.666666666666664]
["Midnight Mayhem",21,92,"S",45.523809523809526]
["Midnight Myth",27,73,"S",34.925925925925924]
["Midnight Spark",20,59,"S",60.333333333333343]
["Midnight Sun",16,74,"S",75.333333333333329]
["Midnight Surprizes",15,122,"D",66]
["Midnight Wanderer",20,78,"S",54]
["Miffie",20,103,"S",45.666666666666671]
["Mig",22,87,"S",43.727272727272727]
["Mighty blue",19,80,"S",57.543859649122808]
["Mighty Man",25,60,"S",44]
["Mighty Snazy",15,85,"S",78.333333333333329]
["Mika",18,62,"S",68.222222222222229]
["Mike",23,98,"D",36.898550724637673]
["Mikey",22,106,"S",37.393939393939391]
["Milan",22,81,"S",45.727272727272727]
["Miles",20,66,"S",58]
["Miles Mirical Dancer",20,118,"D",40.666666666666671]
["Milky",20,106,"D",44.666666666666671]
["Milky Way",25,68,"S",41.333333333333343]
["Millefeuille",19,98,"D",51.543859649122808]
["Millenium",16,73,"S",75.666666666666671]
["Millenium Rose",20,92,"D",49.333333333333329]
["Milley",20,92,"S",49.333333333333329]
["Millie",16,80,"S",73.333333333333329]
["Milly",21,74,"S",51.523809523809526]
["Milo",24,90,"S",36.666666666666664]
["Milord",26,77,"S",35.871794871794869]
["Milpreve",16,87,"S",71]
["Mindy",22,62,"S",52.060606060606062]
["Mini",26,70,"S",38.205128205128204]
["Mini Me",18,90,"S",58.888888888888886]
["Mini-me",22,96,"D",40.727272727272727]
["Minnie",16,64,"S",78.666666666666671]
["Mint",26,116,"D",22.871794871794869]
["Mint-julip",20,97,"S",47.666666666666671]
["Minx",25,101,"D",30.333333333333336]
["Miracle",23,119,"D",29.898550724637676]
["Miracles Are Real",25,61,"S",43.666666666666671]
["Mirage",20,70,"S",56.666666666666657]
["Mirren",20,113,"D",42.333333333333329]
["Mirror Image",17,65,"S",72.450980392156865]
["Mischief",19,88,"S",54.877192982456137]
["Mischief Miss",25,115,"S",25.666666666666664]
["Miscief",25,78,"S",38]
["Miss Congeniality",20,97,"S",47.666666666666671]
["Miss Dottie West",27,91,"S",28.925925925925924]
["Miss Ellie",18,97,"D",56.555555555555557]
["Miss Fortune",26,98,"D",28.871794871794865]
["Miss Jones",19,76,"S",58.877192982456137]
["Miss Kitty",18,85,"S",60.555555555555557]
["Miss Mount",20,113,"D",42.333333333333329]
["Miss Poco Dot Com",24,115,"S",28.333333333333336]
["Miss Priss",19,88,"S",54.877192982456137]
["Miss Spots",22,83,"S",45.060606060606062]
["Miss T",22,68,"S",50.060606060606062]
["Miss-A-Sis",27,67,"S",36.925925925925924]
["Missedent",22,79,"S",46.393939393939391]
["Missing Link",19,84,"S",56.210526315789473]
["Mission",20,84,"S",52]
["Missy",26,96,"D",29.53846153846154]
["Mister Man",22,97,"D",40.393939393939391]
["Mister Mime",27,77,"S",33.592592592592595]
["Mister Nibbles",19,93,"S",53.210526315789473]
["Mister Saturday Night",21,121,"D",35.857142857142861]
["Mistery",21,104,"D",41.523809523809518]
["Mistic",27,118,"D",19.925925925925927]
["Mistico",26,79,"S",35.205128205128204]
["Mistral",18,60,"S",68.888888888888886]
["Mistress",20,94,"D",48.666666666666671]
["Mistro",24,98,"S",34]
["Misty",21,98,"S",43.523809523809518]
["Misty Blue",20,117,"S",41]
["Misty Mae",24,105,"D",31.666666666666668]
["Misty Moon",21,86,"S",47.523809523809526]
["Misty's Dream",22,72,"S",48.727272727272727]
["Mo",21,71,"S",52.523809523809526]
["Mocha",20,68,"S",57.333333333333343]
["Mocha Locha",20,104,"S",45.333333333333329]
["Mochachino",27,96,"S",27.25925925925926]
["Moci",19,73,"S",59.877192982456137]
["Moejo the Man Eater",26,107,"S",25.871794871794869]
["Mohawk",16,120,"D",60]
["Molina",19,102,"D",50.210526315789473]
["Mollie",26,99,"D",28.53846153846154]
["Molly",24,90,"S",36.666666666666664]
["Molson",20,61,"S",59.666666666666657]
["Momentum",19,77,"S",58.543859649122808]
["Monday Mac",17,114,"D",56.117647058823529]
["Money",19,90,"S",54.210526315789473]
["Monglow",24,94,"D",35.333333333333329]
["Monopoly",23,92,"S",38.89855072463768]
["Montana",19,77,"S",58.543859649122808]
["Montana Bay",23,120,"S",29.565217391304348]
["Montana Dream",17,79,"S",67.784313725490193]
["Montana Miracle",21,90,"S",46.19047619047619]
["Montana Sky",17,89,"S",64.450980392156865]
["Montego",19,90,"S",54.210526315789473]
["Montego Bay",18,111,"D",51.888888888888886]
["Monty",27,88,"S",29.925925925925924]
["Moon",20,63,"S",59]
["Moon Dancer",18,93,"S",57.888888888888886]
["Moon foal",20,86,"S",51.333333333333329]
["Moon Glow",26,123,"D",20.53846153846154]
["Moon Shine",20,90,"S",50]
["Moon Struck",19,92,"D",53.543859649122808]
["Moonay",21,85,"S",47.857142857142861]
["Moonbeam",21,60,"S",56.19047619047619]
["Moondancer",15,95,"D",75]
["Moonglow",16,66,"S",78]
["Moonlight",22,66,"S",50.727272727272727]
["Moonlight Blue",23,122,"S",28.898550724637676]
["Moonlight Sonata",20,120,"D",40]
["Moonlight Sun",22,80,"S",46.060606060606062]
["Moonlit Night",20,86,"S",51.333333333333329]
["Moonlite Kiss",19,101,"S",50.543859649122808]
["Moonshadow",15,74,"S",82]
["Moonshine",20,66,"S",58]
["Moonwind",17,111,"D",57.117647058823529]
["Moorcroft",15,92,"S",76]
["Moose",23,72,"S",45.565217391304344]
["Morgan",16,92,"D",69.333333333333329]
["Morgan le Fay",22,63,"S",51.727272727272727]
["Morgan's Magic",17,97,"S",61.784313725490208]
["Morgause",22,90,"S",42.727272727272727]
["Moriah",19,83,"S",56.543859649122808]
["Morning",21,76,"S",50.857142857142861]
["Morning Dew",22,110,"S",36.060606060606062]
["Morning Glory",23,75,"S",44.565217391304344]
["Morning Miracle",19,122,"D",43.543859649122808]
["Morning Star",26,59,"S",41.871794871794876]
["Morning's Moon",20,82,"S",52.666666666666671]
["Morning's Star.",22,89,"S",43.060606060606062]
["Moses Lunar Sundy",20,67,"S",57.666666666666657]
["Mosses",26,84,"S",33.53846153846154]
["Most Valuble Player",17,109,"D",57.784313725490208]
["Most Wanted",26,77,"S",35.871794871794869]
["Motana Sky",15,92,"S",76]
["Moulin Rouge",21,79,"S",49.857142857142861]
["Mountain",21,67,"S",53.857142857142861]
["Mountain Burst",20,84,"S",52]
["Mountain Rush",23,92,"S",38.89855072463768]
["Mouse",27,60,"S",39.25925925925926]
["Mouse Over",19,75,"S",59.210526315789473]
["Moustache",24,97,"D",34.333333333333336]
["Mozart",21,82,"S",48.857142857142861]
["Mr Bigshot",20,96,"S",48]
["Mr blobby",21,94,"D",44.857142857142854]
["Mr Co-Co Bean",20,74,"S",55.333333333333336]
["Mr Cool",26,82,"S",34.205128205128204]
["Mr Ed",21,71,"S",52.523809523809526]
["Mr Hollywood",27,95,"S",27.592592592592595]
["Mr Miami",19,97,"S",51.877192982456137]
["Mr Monty",23,69,"S",46.565217391304344]
["Mr Niceguy",21,122,"D",35.523809523809518]
["Mr Viner",27,79,"S",32.925925925925924]
["Mr. Blue",24,111,"S",29.666666666666668]
["Mr. Ed",21,98,"D",43.523809523809518]
["Mr. Ed Talks Again",25,60,"S",44]
["Mr. Gallop",19,73,"S",59.877192982456137]
["Mr. Gentleman Swift",24,123,"S",25.666666666666664]
["Mr. Midnight",22,117,"D",33.727272727272727]
["Mr. Perposterous",17,90,"S",64.117647058823536]
["Mr. T",19,95,"D",52.543859649122808]
["Mr. Wonderful",23,117,"S",30.565217391304348]
["Mrs. Americus",26,91,"S",31.205128205128208]
["Ms.Gallop",21,110,"D",39.523809523809518]
["Muchi",22,116,"S",34.060606060606062]
["Mudslide",20,83,"S",52.333333333333329]
["Mufasa",27,98,"S",26.592592592592588]
["Mugsy",20,84,"S",52]
["Mulder",21,98,"S",43.523809523809518]
["Mungo",27,81,"S",32.25925925925926]
["Murasaki (purple in japanese)",17,105,"S",59.117647058823529]
["Murphy",15,117,"D",67.666666666666671]
["Muscade",18,91,"S",58.555555555555557]
["Must be Dreaming",21,118,"S",36.857142857142861]
["Must Be Magic",22,115,"S",34.393939393939391]
["Mustang",18,73,"S",64.555555555555557]
["Mustang Sally",19,63,"S",63.210526315789473]
["Mustard",19,97,"D",51.877192982456137]
["Mutiny",24,93,"S",35.666666666666664]
["My Alibi",25,59,"S",44.333333333333329]
["My Boy",16,102,"S",66]
["My Centennial Rose",20,123,"D",39]
["My Friend",24,94,"S",35.333333333333329]
["My Heart's Desire",26,89,"S",31.871794871794869]
["My Hero",17,90,"S",64.117647058823536]
["My Integrity",17,114,"D",56.117647058823529]
["My kind of guy",22,91,"S",42.393939393939391]
["My kinda Girl",23,79,"S",43.231884057971016]
["My Lil Pony",20,97,"D",47.666666666666671]
["My Little Drummer Boy",22,88,"S",43.393939393939391]
["My Little Joy",27,89,"S",29.592592592592595]
["My Lovely Rebel",23,94,"S",38.231884057971016]
["My Lucky Day",26,105,"S",26.53846153846154]
["My Maria",21,83,"S",48.523809523809526]
["My New Nikes",26,75,"S",36.53846153846154]
["My Passionate Rose",19,97,"D",51.877192982456137]
["My Prince",20,89,"S",50.333333333333329]
["My Quite Music",23,77,"S",43.89855072463768]
["My Sassy Kat",22,62,"S",52.060606060606062]
["My Sir Guy",26,80,"S",34.871794871794869]
["My Way",25,101,"S",30.333333333333336]
["Mylie",23,87,"S",40.565217391304344]
["Mysterious",21,98,"D",43.523809523809518]
["Mysterious Lady",23,62,"S",48.898550724637687]
["Mystery",19,92,"D",53.543859649122808]
["Mystic",19,88,"S",54.877192982456137]
["Mystic Dream",27,81,"S",32.25925925925926]
["Mystic Moon Dancer",20,78,"S",54]
["Mystical",16,69,"S",77]
["Mystical Magic",22,74,"S",48.060606060606062]
["Mystical Magician",24,82,"S",39.333333333333329]
["Mystical Night",21,82,"S",48.857142857142861]
["Mystical Star",19,118,"D",44.877192982456137]
["Mystical White Princess",21,69,"S",53.19047619047619]
["Mystique",26,61,"S",41.205128205128204]
["Mystro",15,74,"S",82]
["Mysty",15,100,"D",73.333333333333343]
["Nabisco",19,74,"S",59.543859649122808]
["Nabisco Cracker",22,61,"S",52.393939393939391]
["Nabrina",19,112,"D",46.877192982456137]
["Nadia",23,93,"D",38.565217391304344]
["Nadine Novelle",27,85,"S",30.925925925925924]
["Naduah Mccue",16,103,"S",65.666666666666657]
["Nafa (Arabic=useful)",26,92,"D",30.871794871794869]
["Nakima",21,102,"D",42.19047619047619]
["Naksup",16,103,"D",65.666666666666657]
["Nanook",17,63,"S",73.117647058823536]
["Napoleon",23,95,"D",37.89855072463768]
["Naraskanaia",22,83,"S",45.060606060606062]
["Narita",26,92,"S",30.871794871794869]
["Narnia",19,71,"S",60.543859649122808]
["Nash",25,64,"S",42.666666666666657]
["Natalie",20,93,"D",49]
["Natasha",21,68,"S",53.523809523809526]
["Nate",20,86,"S",51.333333333333329]
["Nate's Nikes",22,62,"S",52.060606060606062]
["Natiqua",15,62,"S",86]
["Natural Element",23,117,"S",30.565217391304348]
["Nature's Basics",22,85,"S",44.393939393939391]
["Nautical Adventure",17,84,"S",66.117647058823536]
["Navaho",19,98,"S",51.543859649122808]
["Navajo",19,90,"S",54.210526315789473]
["Navar",25,62,"S",43.333333333333343]
["Navigator",16,94,"D",68.666666666666671]
["Nearly perfect",20,118,"S",40.666666666666671]
["Ned",22,122,"D",32.060606060606062]
["Neealba",24,67,"S",44.333333333333329]
["Nellie",18,103,"D",54.555555555555557]
["Nelly",16,89,"S",70.333333333333329]
["Nelson",19,80,"S",57.543859649122808]
["Nemo",23,90,"S",39.565217391304344]
["Neon",27,98,"D",26.592592592592588]
["Neptune",15,78,"S",80.666666666666657]
["Neriffe",22,89,"S",43.060606060606062]
["Nero",24,83,"S",39]
["Netty",20,87,"S",51]
["Nevada",18,109,"S",52.555555555555557]
["Nevada Sky",15,103,"D",72.333333333333343]
["Nevaeh Sky (Heaven Backwards)",25,92,"S",33.333333333333336]
["Nevarra",18,85,"S",60.555555555555557]
["Never say Never",19,82,"S",56.877192982456137]
["Nevertheless",27,66,"S",37.25925925925926]
["New Hope",19,111,"S",47.210526315789473]
["New York Minute",23,80,"S",42.89855072463768]
["Niagara",25,92,"D",33.333333333333336]
["Nibbles",23,86,"S",40.89855072463768]
["Nibbley",20,95,"S",48.333333333333329]
["Nibby",20,84,"S",52]
["Nick",24,90,"S",36.666666666666664]
["Nicker To Me",22,80,"S",46.060606060606062]
["Nicki",23,108,"D",33.565217391304344]
["Nickles 'n Dimes",22,105,"D",37.727272727272727]
["Nicole",21,67,"S",53.857142857142861]
["Nifty",21,106,"D",40.857142857142861]
["Night Chronicles",25,88,"S",34.666666666666664]
["Night Dancer",22,76,"S",47.393939393939391]
["Night Flight",22,100,"D",39.393939393939391]
["Night Out",21,79,"S",49.857142857142861]
["Night Raven",17,107,"S",58.450980392156858]
["Night Show",20,72,"S",56]
["Night Stalker",18,66,"S",66.888888888888886]
["Night Train",20,112,"D",42.666666666666671]
["Nightlight",23,86,"S",40.89855072463768]
["Nike's New Found Glory",19,88,"S",54.877192982456137]
["Nikita",25,82,"S",36.666666666666664]
["Nikki",24,94,"D",35.333333333333329]
["Niko",27,97,"S",26.925925925925927]
["Nila Skips Cool",18,113,"D",51.222222222222221]
["Nilly",22,77,"S",47.060606060606062]
["Nimaway",18,60,"S",68.888888888888886]
["Nimbus",27,70,"S",35.925925925925924]
["Nimfo Noon",22,80,"S",46.060606060606062]
["Ninjo",21,75,"S",51.19047619047619]
["Nirvana",19,120,"S",44.210526315789473]
["Nitro",27,59,"S",39.592592592592595]
["No Fear",26,63,"S",40.53846153846154]
["No Regrets",16,94,"D",68.666666666666671]
["Noble",16,74,"S",75.333333333333329]
["Noel",22,99,"D",39.727272727272727]
["Nor",20,78,"S",54]
["Nordance Prince",21,82,"S",48.857142857142861]
["Nor'Easter",22,75,"S",47.727272727272727]
["Northen star",26,81,"S",34.53846153846154]
["Northern Lights",22,94,"D",41.393939393939391]
["Norton",15,71,"S",83]
["Nosey",26,63,"S",40.53846153846154]
["Not At the Moment",19,64,"S",62.877192982456137]
["Not Exactly Monday",20,61,"S",59.666666666666657]
["Nothin' But Trouble",17,95,"D",62.450980392156865]
["Notorious",16,107,"D",64.333333333333343]
["Notorized Kate",20,121,"D",39.666666666666671]
["Nottachance",18,89,"S",59.222222222222229]
["Nougat",23,78,"S",43.565217391304344]
["November Rain",26,118,"D",22.205128205128212]
["Now or never",19,121,"S",43.877192982456137]
["Nuala",21,113,"D",38.523809523809518]
["Nubia's Princess",27,73,"S",34.925925925925924]
["Nugget",21,76,"S",50.857142857142861]
["Nutcracker",16,60,"S",80]
["Nutmeg",21,66,"S",54.19047619047619]
["Nuts",25,88,"S",34.666666666666664]
["Nutty",16,73,"S",75.666666666666671]
["O my Gosh",17,83,"S",66.450980392156865]
["O.Brien",17,94,"D",62.7843137254902]
["Oak",21,59,"S",56.523809523809518]
["Oasis",21,116,"D",37.523809523809518]
["Oberon",16,106,"D",64.666666666666657]
["Obi-Wan",24,95,"S",35]
["Oblivion",22,62,"S",52.060606060606062]
["Obsidian Dream",22,91,"S",42.393939393939391]
["Occasional Flurries",20,75,"S",55]
["Ocean",18,98,"D",56.222222222222221]
["Ocean Breeze",16,91,"S",69.666666666666671]
["Ocean Crest",15,78,"S",80.666666666666657]
["Ocean Jupiter",21,120,"S",36.19047619047619]
["October Spirit",21,83,"S",48.523809523809526]
["October Wind",21,112,"S",38.857142857142861]
["Oddball",20,99,"D",47]
["Oddossen Dreamer",19,85,"S",55.877192982456137]
["Odin",26,95,"D",29.871794871794869]
["Odyssy",23,109,"S",33.231884057971023]
["Odyssy",15,64,"S",85.333333333333329]
["Off Shores Pearl",20,81,"S",53]
["Official",19,95,"D",52.543859649122808]
["Oh Cash Go",20,120,"D",40]
["Oh my Darling",15,85,"S",78.333333333333329]
["OJ",17,108,"D",58.117647058823529]
["Oki Doki",18,112,"S",51.555555555555557]
["Okotok",23,80,"S",42.89855072463768]
["Old Faithful",19,60,"S",64.21052631578948]
["Old Lady",19,108,"D",48.210526315789473]
["Oliver",17,83,"S",66.450980392156865]
["Oliver twist",15,77,"S",81]
["Olivia",17,84,"S",66.117647058823536]
["Ollie",15,100,"S",73.333333333333343]
["Olympic Dream",20,88,"S",50.666666666666671]
["Olympic Glory",16,68,"S",77.333333333333329]
["Olympus",20,120,"D",40]
["Omah",16,91,"S",69.666666666666671]
["On High Heels",18,62,"S",68.222222222222229]
["On target",22,83,"S",45.060606060606062]
["On With Jon",15,68,"S",84]
["Once in a Blue Moon",20,60,"S",60]
["One Fine Day",18,98,"D",56.222222222222221]
["One in a Million",22,81,"S",45.727272727272727]
["One Night Only",21,79,"S",49.857142857142861]
["One O'clock Call",20,73,"S",55.666666666666664]
["One Shot At A Time",25,84,"S",36]
["One Way Ticket",20,79,"S",53.666666666666671]
["One Wish",21,82,"S",48.857142857142861]
["Oni (japanese for devil)",27,84,"S",31.25925925925926]
["Onix",22,72,"S",48.727272727272727]
["Onyx",25,68,"S",41.333333333333343]
["Opal",17,78,"S",68.117647058823536]
["Opaleye",15,98,"D",74]
["Oppey",15,59,"S",87]
["Orchid",21,87,"S",47.19047619047619]
["Ordered Steps",25,112,"D",26.666666666666664]
["Oreo",19,83,"S",56.543859649122808]
["Organized Rebel",20,70,"S",56.666666666666657]
["Orion",26,61,"S",41.205128205128204]
["Orkney Mist",22,83,"S",45.060606060606062]
["Oscar",22,105,"D",37.727272727272727]
["Othello",19,92,"D",53.543859649122808]
["Otis",26,96,"S",29.53846153846154]
["Outlaw",18,122,"D",48.222222222222221]
["Outta Sight",20,87,"S",51]
["OverTime Magic",22,93,"D",41.727272727272727]
["P.J.",27,101,"D",25.592592592592588]
["P.S. I Love You",20,91,"S",49.666666666666671]
["Pablo",16,79,"S",73.666666666666671]
["Pacheco",17,100,"S",60.784313725490208]
["Pacific Popsicle",26,108,"S",25.53846153846154]
["Pacifics Majic Khol",18,97,"D",56.555555555555557]
["Pacos",20,90,"S",50]
["Paddington",18,90,"S",58.888888888888886]
["Paddington B. Bear",20,94,"D",48.666666666666671]
["Paddington J. Bear",22,72,"S",48.727272727272727]
["Paddy",20,100,"D",46.666666666666671]
["Paddy Bear",21,87,"S",47.19047619047619]
["Pagong",19,83,"S",56.543859649122808]
["Paint",19,78,"S",58.210526315789473]
["Paint by numbers",21,61,"S",55.857142857142861]
["Paint me Proud",21,113,"S",38.523809523809518]
["Paint the Town",19,90,"S",54.210526315789473]
["Painted Apache",19,99,"S",51.210526315789473]
["Painted Robin",15,113,"S",69]
["Painter",20,90,"S",50]
["PaintTheTownRed",22,94,"D",41.393939393939391]
["Paisley",19,95,"D",52.543859649122808]
["Pal",16,123,"D",59]
["Pal Amino",18,97,"S",56.555555555555557]
["Paladen",17,93,"D",63.117647058823529]
["Paladin",17,95,"D",62.450980392156865]
["Paladine",17,79,"S",67.784313725490193]
["Paloma (means dove)",17,99,"D",61.117647058823529]
["Pamplemousse",18,100,"D",55.555555555555557]
["Panda",26,78,"S",35.53846153846154]
["Pandemonium",16,81,"S",73]
["Pandora",15,78,"S",80.666666666666657]
["Pandora's Box",25,81,"S",37]
["Panosh",21,95,"D",44.523809523809526]
["Pansy",18,99,"D",55.888888888888886]
["Papa Drew",16,81,"S",73]
["Par Hasard",27,96,"D",27.25925925925926]
["Parable",16,89,"S",70.333333333333329]
["Pardon My Dust",19,73,"S",59.877192982456137]
["Paris",22,79,"S",46.393939393939391]
["Paris City of Romance",15,64,"S",85.333333333333329]
["Parker",19,89,"S",54.543859649122808]
["Parrot Head",19,90,"S",54.210526315789473]
["Partee Music",25,123,"D",23]
["Partner",18,66,"S",66.888888888888886]
["Party Politics",15,77,"S",81]
["Pascoe",17,102,"S",60.117647058823529]
["Pasha",17,76,"S",68.784313725490193]
["Pass N Style",26,81,"S",34.53846153846154]
["Passion",18,81,"S",61.888888888888886]
["Passion Princess",26,84,"S",33.53846153846154]
["Patch",22,97,"S",40.393939393939391]
["Patches",21,78,"S",50.19047619047619]
["Patchwork Quilt",23,104,"D",34.898550724637673]
["Patience",26,93,"S",30.53846153846154]
["Patra",17,101,"D",60.450980392156858]
["Patrick",16,81,"S",73]
["Patriot",21,96,"D",44.19047619047619]
["Patty-cake",18,105,"D",53.888888888888886]
["Paulo",23,101,"S",35.898550724637673]
["Pavane",20,102,"D",46]
["Pay Check",19,69,"S",61.210526315789473]
["Paydro",21,87,"S",47.19047619047619]
["Peach",15,94,"D",75.333333333333329]
["Peach Blossom",19,64,"S",62.877192982456137]
["Peaches",24,77,"S",41]
["Peaches n Cream",23,98,"D",36.898550724637673]
["Peak",24,63,"S",45.666666666666671]
["Peanut",23,99,"D",36.565217391304344]
["Peanut Butter",20,101,"D",46.333333333333329]
["Pearl",20,61,"S",59.666666666666657]
["Pearl Harbor",20,77,"S",54.333333333333329]
["Pebbles",25,68,"S",41.333333333333343]
["Pegasus",17,81,"S",67.117647058823536]
["Pegasus Belle",16,75,"S",75]
["Peggy Sue",19,93,"S",53.210526315789473]
["Pegretta",18,72,"S",64.888888888888886]
["Pendragon",21,98,"D",43.523809523809518]
["Penelope",26,82,"S",34.205128205128204]
["Pennsylvania",27,78,"S",33.25925925925926]
["Penny",15,75,"S",81.666666666666657]
["Pepi",22,70,"S",49.393939393939391]
["Pepper",18,120,"S",48.888888888888886]
["Peppercorn",22,109,"D",36.393939393939391]
["Peppermint",24,106,"S",31.333333333333336]
["Peppie",26,65,"S",39.871794871794869]
["Peppoli",21,107,"S",40.523809523809518]
["Peppy",20,71,"S",56.333333333333343]
["Pepsi",26,102,"D",27.53846153846154]
["Percy",26,70,"S",38.205128205128204]
["Perfect Dream",22,73,"S",48.393939393939391]
["Perfect Harmony",21,86,"S",47.523809523809526]
["Perfect Lullabi",27,97,"D",26.925925925925927]
["Perfect Note",22,110,"S",36.060606060606062]
["Perfect Picture",21,80,"S",49.523809523809526]
["Perfect Winter",19,85,"S",55.877192982456137]
["Perfection",15,98,"S",74]
["Pericles",16,77,"S",74.333333333333329]
["Peridot",18,83,"S",61.222222222222229]
["Perseus",21,105,"D",41.19047619047619]
["Petal",22,66,"S",50.727272727272727]
["Pete",26,61,"S",41.205128205128204]
["Peter",27,79,"S",32.925925925925924]
["Peter Pan",23,94,"S",38.231884057971016]
["Peter Piper",26,95,"D",29.871794871794869]
["Peter The Pumpkin Eater",15,68,"S",84]
["Petie",20,109,"D",43.666666666666671]
["Petzi",19,120,"S",44.210526315789473]
["Peyton",22,119,"D",33.060606060606062]
["Phantagero",26,80,"S",34.871794871794869]
["Phantasia",22,92,"D",42.060606060606062]
["Phantom",18,119,"S",49.222222222222221]
["Pharoah",20,81,"S",53]
["Pheebe",27,72,"S",35.25925925925926]
["Phenomenon",16,115,"D",61.666666666666664]
["Pheonix",21,81,"S",49.19047619047619]
["Philadelphia",19,98,"D",51.543859649122808]
["Phillis",21,70,"S",52.857142857142861]
["Philly",23,83,"S",41.89855072463768]
["Phoebe",18,89,"S",59.222222222222229]
["Phoenix",16,61,"S",79.666666666666671]
["Phomeron",22,115,"S",34.393939393939391]
["Picasso",20,118,"D",40.666666666666671]
["Picket",21,87,"S",47.19047619047619]
["Picture Perfect",17,90,"S",64.117647058823536]
["Pie",15,75,"S",81.666666666666657]
["Pied",19,59,"S",64.543859649122808]
["Pilgrim",21,91,"S",45.857142857142854]
["Pilot",21,97,"D",43.857142857142861]
["Pinafore",21,121,"D",35.857142857142861]
["Pines Flasher",21,79,"S",49.857142857142861]
["Pines Toast",22,99,"D",39.727272727272727]
["Pineside Denver",26,87,"S",32.53846153846154]
["Pink Panther",16,100,"S",66.666666666666657]
["Piper",22,82,"S",45.393939393939391]
["Pippa",22,64,"S",51.393939393939391]
["Pippi",19,108,"D",48.210526315789473]
["Pippin",23,69,"S",46.565217391304344]
["Pippy",20,100,"D",46.666666666666671]
["Pippy Long Stoking",23,90,"S",39.565217391304344]
["Pirate",18,100,"D",55.555555555555557]
["Pistol",27,74,"S",34.592592592592595]
["Piticelle",22,70,"S",49.393939393939391]
["Pittsburgh",17,120,"D",54.117647058823529]
["Pixie",17,117,"D",55.117647058823529]
["Pizazz",18,86,"S",60.222222222222229]
["PK",15,73,"S",82.333333333333329]
["Plain N Simple",26,103,"D",27.205128205128212]
["Play ta Win",20,91,"S",49.666666666666671]
["Playboy",21,98,"D",43.523809523809518]
["Player",23,87,"S",40.565217391304344]
["Playin' Doubles",17,59,"S",74.450980392156865]
["Please Baby Please",20,80,"S",53.333333333333329]
["Please Pass The Chic",27,93,"D",28.25925925925926]
["Pleasentville Dream",23,76,"S",44.231884057971016]
["Plesaures",21,63,"S",55.19047619047619]
["Plunket",22,75,"S",47.727272727272727]
["Pluto",25,99,"D",31]
["Pocaroo",15,93,"D",75.666666666666657]
["Pocket Rocket",22,94,"D",41.393939393939391]
["Pockets",26,73,"S",37.205128205128204]
["Poco",21,74,"S",51.523809523809526]
["Poco's Black Charger",20,98,"S",47.333333333333329]
["Poe",26,76,"S",36.205128205128204]
["Poetry",22,105,"D",37.727272727272727]
["Poetry in Motion",17,78,"S",68.117647058823536]
["Point",19,74,"S",59.543859649122808]
["Point Taken",23,111,"D",32.565217391304344]
["Pokey",26,66,"S",39.53846153846154]
["Pokey Joe",22,116,"D",34.060606060606062]
["Polar",20,78,"S",54]
["Polar Express",21,84,"S",48.19047619047619]
["Polka",22,98,"D",40.060606060606062]
["Polly",27,104,"D",24.592592592592588]
["Polly-Anna",19,91,"S",53.877192982456137]
["Polo",22,65,"S",51.060606060606062]
["Polo Player",22,85,"S",44.393939393939391]
["Poly Anna",17,101,"S",60.450980392156858]
["Pompom",21,107,"S",40.523809523809518]
["Pongo",23,106,"S",34.231884057971023]
["Pontiac",19,117,"S",45.210526315789473]
["Pony",19,71,"S",60.543859649122808]
["Poo Bear",23,102,"S",35.565217391304351]
["Pook",19,72,"S",60.210526315789473]
["Pookie",25,86,"S",35.333333333333336]
["Popcorn",27,93,"D",28.25925925925926]
["Poppy",21,89,"S",46.523809523809526]
["Porthos",19,72,"S",60.210526315789473]
["Portia",26,94,"D",30.205128205128208]
["Porto",19,73,"S",59.877192982456137]
["Posey",22,62,"S",52.060606060606062]
["Posie",24,89,"S",37]
["Positively Platnum",20,121,"S",39.666666666666671]
["Possibly Me",21,62,"S",55.523809523809518]
["Poster Pony",21,111,"D",39.19047619047619]
["Powder",15,102,"S",72.666666666666657]
["Powder River",15,69,"S",83.666666666666657]
["Power Point",21,77,"S",50.523809523809526]
["Pracital Cat",22,73,"S",48.393939393939391]
["Prada",23,104,"S",34.898550724637673]
["Prancer",16,89,"S",70.333333333333329]
["Preacher",24,90,"S",36.666666666666664]
["Precious Jewel",22,85,"S",44.393939393939391]
["Precious Moment",23,70,"S",46.231884057971016]
["Precious Moments",15,81,"S",79.666666666666657]
["Prelizee",16,78,"S",74]
["Prescription",15,101,"D",73]
["Prestys",27,86,"S",30.592592592592595]
["Pretty Boy",17,101,"D",60.450980392156858]
["Pretty Copper Penny",23,90,"S",39.565217391304344]
["Pretty In Pink",15,82,"S",79.333333333333329]
["Pretty Kitty",20,86,"S",51.333333333333329]
["Prickles",20,95,"D",48.333333333333329]
["Pride",27,64,"S",37.925925925925924]
["Pride and Joy",20,83,"S",52.333333333333329]
["Pride N Joy",24,96,"S",34.666666666666664]
["Prim",27,108,"D",23.25925925925926]
["Prima",15,79,"S",80.333333333333329]
["Primadona",21,68,"S",53.523809523809526]
["Primo Baby",18,81,"S",61.888888888888886]
["Prince",25,90,"S",34]
["Prince Caspian",19,104,"S",49.543859649122808]
["Prince Charming",16,84,"S",72]
["Prince Condor",22,73,"S",48.393939393939391]
["Prince of Thieves",24,94,"D",35.333333333333329]
["Prince Sevilliane",16,99,"D",67]
["Prince Timmy",22,77,"S",47.060606060606062]
["Prince Vailiant",21,85,"S",47.857142857142861]
["Princess",22,120,"D",32.727272727272727]
["Princess Ida",17,99,"S",61.117647058823529]
["Princeton",17,78,"S",68.117647058823536]
["Prison Guard",16,62,"S",79.333333333333329]
["Prissy",15,120,"D",66.666666666666671]
["Prixie",21,70,"S",52.857142857142861]
["Prize",23,98,"S",36.898550724637673]
["Prizeman",20,83,"S",52.333333333333329]
["Promise",15,78,"S",80.666666666666657]
["Promised Day",19,97,"S",51.877192982456137]
["Prospector",19,72,"S",60.210526315789473]
["Prudince",27,67,"S",36.925925925925924]
["Prymos",24,108,"D",30.666666666666668]
["Pull up my socks",15,108,"D",70.666666666666657]
["Pumpkin",23,92,"D",38.89855072463768]
["Punch",21,69,"S",53.19047619047619]
["Punk",21,123,"D",35.19047619047619]
["Punkin",25,104,"S",29.333333333333336]
["Punky",19,78,"S",58.210526315789473]
["Purdey",19,61,"S",63.877192982456137]
["Pure",26,97,"S",29.205128205128212]
["Pure star",19,117,"D",45.210526315789473]
["Pure Valor",15,98,"S",74]
["Putney Bridge",19,86,"S",55.543859649122808]
["Puzzels",25,90,"S",34]
["Puzzle",18,100,"S",55.555555555555557]
["Puzzle Pieces",21,79,"S",49.857142857142861]
["QT",17,99,"D",61.117647058823529]
["Q-tip",16,78,"S",74]
["Quail",24,109,"D",30.333333333333336]
["Quantum",26,73,"S",37.205128205128204]
["Quark",25,92,"D",33.333333333333336]
["Quarter Mane",22,101,"D",39.060606060606062]
["Quasar",21,93,"D",45.19047619047619]
["Quavo's Little Man",22,79,"S",46.393939393939391]
["Quazar",24,69,"S",43.666666666666671]
["Queen",22,80,"S",46.060606060606062]
["Queen Lady Mint",20,113,"S",42.333333333333329]
["Queen of Hearts",20,123,"D",39]
["Queen of Spades",23,113,"D",31.898550724637676]
["Queen of Swords",17,81,"S",67.117647058823536]
["Queenie",23,68,"S",46.89855072463768]
["Queeny",21,83,"S",48.523809523809526]
["Quentin",25,71,"S",40.333333333333343]
["Quest",21,79,"S",49.857142857142861]
["Question Mark",15,95,"D",75]
["Questionable",27,121,"S",18.925925925925927]
["Quick Glitter",20,77,"S",54.333333333333329]
["Quick Shot",22,73,"S",48.393939393939391]
["Quick Silver",19,93,"D",53.210526315789473]
["Quick Split",25,89,"S",34.333333333333336]
["Quick Timez",23,77,"S",43.89855072463768]
["Quicksilver",22,98,"S",40.060606060606062]
["Quickstep",16,84,"S",72]
["Quidam",20,107,"S",44.333333333333329]
["Quimby",21,112,"S",38.857142857142861]
["Quimico",20,83,"S",52.333333333333329]
["Quincy",26,83,"S",33.871794871794869]
["Quinn",19,88,"S",54.877192982456137]
["Quinton",26,59,"S",41.871794871794876]
["Quiver",24,71,"S",43]
["Quiz Master",21,70,"S",52.857142857142861]
["Quizzical",20,95,"D",48.333333333333329]
["R and B",24,94,"D",35.333333333333329]
["R Independence",19,93,"D",53.210526315789473]
["Raaj",22,71,"S",49.060606060606062]
["Rabbani",16,97,"S",67.666666666666657]
["Race the Moon",19,100,"S",50.877192982456137]
["Racer",26,69,"S",38.53846153846154]
["Rachel",27,98,"D",26.592592592592588]
["Raffle",21,111,"S",39.19047619047619]
["Rage",19,84,"S",56.210526315789473]
["Rageous",22,87,"S",43.727272727272727]
["Raggedy Anne",23,119,"D",29.898550724637676]
["Raging Fire",27,94,"S",27.925925925925924]
["Rags",19,60,"S",64.21052631578948]
["Rain",21,100,"D",42.857142857142861]
["Rain Dancer",22,98,"D",40.060606060606062]
["Rainbow",25,69,"S",41]
["Raindrop",18,98,"D",56.222222222222221]
["Raindrops on Roses",26,115,"S",23.205128205128212]
["Raine",20,69,"S",57]
["RainSplasher",15,64,"S",85.333333333333329]
["Rainstone",21,116,"D",37.523809523809518]
["Rainstorm",20,95,"D",48.333333333333329]
["Rainy",24,91,"S",36.333333333333329]
["Rainy Day Blues",21,73,"S",51.857142857142861]
["Raj",18,99,"D",55.888888888888886]
["Ralph",23,75,"S",44.565217391304344]
["Ramblin Man",15,79,"S",80.333333333333329]
["Rambling Rose",15,74,"S",82]
["Rambo",20,88,"S",50.666666666666671]
["Ramodi",17,70,"S",70.784313725490193]
["Ramodi's Rose",21,115,"D",37.857142857142861]
["Ramsis",19,86,"S",55.543859649122808]
["Randy",21,68,"S",53.523809523809526]
["Ranger",15,82,"S",79.333333333333329]
["Ranofer",22,61,"S",52.393939393939391]
["Ransom",17,79,"S",67.784313725490193]
["Ransom Paycheck",20,117,"D",41]
["Raphael",19,122,"D",43.543859649122808]
["Rappadan Glory",26,75,"S",36.53846153846154]
["Rascal",18,65,"S",67.222222222222229]
["Rauli",15,73,"S",82.333333333333329]
["Raven",21,110,"S",39.523809523809518]
["Ravin' Ryan",22,96,"S",40.727272727272727]
["Rawhide",21,76,"S",50.857142857142861]
["Razz",20,69,"S",57]
["Razzamatazz",27,75,"S",34.25925925925926]
["Razzle Dazzle",19,80,"S",57.543859649122808]
["Razzle-my-Tazzle",22,104,"D",38.060606060606062]
["Razzy",20,65,"S",58.333333333333343]
["Reba Dawn",19,103,"S",49.877192982456137]
["Rebel",26,107,"D",25.871794871794869]
["Rebel Pride",19,122,"D",43.543859649122808]
["Rebel's Angel",26,68,"S",38.871794871794869]
["Reckless",23,104,"D",34.898550724637673]
["Red",16,82,"S",72.666666666666671]
["Red Admiral",24,87,"S",37.666666666666664]
["Red Angel",18,73,"S",64.555555555555557]
["Red Baron",22,77,"S",47.060606060606062]
["Red Devil",22,70,"S",49.393939393939391]
["Red Eagle",17,88,"S",64.784313725490193]
["Red Fire",24,103,"D",32.333333333333336]
["Red Man",18,63,"S",67.888888888888886]
["Red Mustang",21,79,"S",49.857142857142861]
["Red Nell",18,121,"D",48.555555555555557]
["Red Oak",26,117,"D",22.53846153846154]
["Red Red Rose",16,117,"D",61]
["Red Rum",20,70,"S",56.666666666666657]
["Red Spring",20,71,"S",56.333333333333343]
["Red Spruce",16,118,"S",60.666666666666664]
["Red Star",17,100,"D",60.784313725490208]
["Red Sunset Sunsation",19,103,"D",49.877192982456137]
["Red Zephyr , The",18,69,"S",65.888888888888886]
["Redeem My Heart",21,72,"S",52.19047619047619]
["Redman",26,73,"S",37.205128205128204]
["Redmond",21,62,"S",55.523809523809518]
["Reds",20,83,"S",52.333333333333329]
["Reds Dawn Mist",22,94,"D",41.393939393939391]
["Redwood",21,83,"S",48.523809523809526]
["Reflexion",20,77,"S",54.333333333333329]
["Regal Blue",21,90,"S",46.19047619047619]
["Regal Classic",15,99,"D",73.666666666666657]
["Regal Empress",20,103,"D",45.666666666666671]
["Reggie",24,100,"D",33.333333333333336]
["Regis",27,104,"S",24.592592592592588]
["ReKognize Me",16,77,"S",74.333333333333329]
["Rembrant",17,66,"S",72.117647058823536]
["Remember Me",21,89,"S",46.523809523809526]
["Remington",25,84,"S",36]
["Remrock",20,121,"D",39.666666666666671]
["Remy",25,109,"D",27.666666666666664]
["Renaissance",17,120,"D",54.117647058823529]
["Renaissance Man",17,67,"S",71.784313725490193]
["Renassiance",26,71,"S",37.871794871794869]
["Renegade",18,121,"D",48.555555555555557]
["Reno",17,71,"S",70.450980392156865]
["Report",20,67,"S",57.666666666666657]
["Request",16,99,"D",67]
["Resoloution",20,104,"D",45.333333333333329]
["Restless",15,84,"S",78.666666666666657]
["Retained Asset",22,116,"D",34.060606060606062]
["Retsy",20,71,"S",56.333333333333343]
["Reverberation",26,109,"D",25.205128205128212]
["Rex",19,99,"S",51.210526315789473]
["Rhambles",22,94,"D",41.393939393939391]
["Rhapsidion Snow",27,120,"S",19.25925925925926]
["Rhiannon",22,106,"D",37.393939393939391]
["Rhubarb",19,77,"S",58.543859649122808]
["Rhyme and Reason",15,80,"S",80]
["Rhythm and Blues",21,69,"S",53.19047619047619]
["Rialta",18,69,"S",65.888888888888886]
["Ribbon",17,75,"S",69.117647058823536]
["Rico",24,107,"D",30.999999999999996]
["Ridgecrest",18,87,"S",59.888888888888886]
["Riding Freedom",26,118,"D",22.205128205128212]
["Ridley",22,95,"S",41.060606060606062]
["Right on the Money",20,82,"S",52.666666666666671]
["Rikash",24,99,"D",33.666666666666664]
["Riley",23,69,"S",46.565217391304344]
["Ring",21,70,"S",52.857142857142861]
["Ringmaster",27,77,"S",33.592592592592595]
["Ringo",21,78,"S",50.19047619047619]
["Rio",27,83,"S",31.592592592592595]
["Rio Rojo",27,92,"S",28.592592592592595]
["Riosealita",20,91,"S",49.666666666666671]
["Ripples",16,101,"D",66.333333333333343]
["Rise to Glory",17,97,"D",61.784313725490208]
["Rising Star",23,74,"S",44.89855072463768]
["Rising Sun",16,70,"S",76.666666666666671]
["Risk Taker",25,96,"S",32]
["Risky Business",18,100,"S",55.555555555555557]
["Rista",20,76,"S",54.666666666666664]
["Ritchies Ticket",16,74,"S",75.333333333333329]
["River Dancer",27,93,"D",28.25925925925926]
["River Phoenix",16,74,"S",75.333333333333329]
["Riverwind",15,65,"S",85]
["Rizzo",23,102,"D",35.565217391304351]
["Roani",20,69,"S",57]
["Rob Roy",24,116,"S",28]
["Robbie",19,101,"D",50.543859649122808]
["Robbin",22,123,"D",31.727272727272727]
["Robin",22,79,"S",46.393939393939391]
["Robin Hood",21,70,"S",52.857142857142861]
["Robins MoonTwist",22,81,"S",45.727272727272727]
["Robyn Hood",19,93,"S",53.210526315789473]
["Rocco",20,73,"S",55.666666666666664]
["Rock",20,105,"S",45]
["Rock Candy",23,94,"D",38.231884057971016]
["Rock Me Zippo",27,73,"S",34.925925925925924]
["Rock Star",27,84,"S",31.25925925925926]
["Rock Steady",17,88,"S",64.784313725490193]
["Rockafellaz Revenge",20,102,"S",46]
["Rocked N Steady",20,121,"D",39.666666666666671]
["Rocked Steady",26,93,"D",30.53846153846154]
["Rocket",17,60,"S",74.117647058823536]
["Rocket Flare",15,99,"S",73.666666666666657]
["Rockin' Robin",16,76,"S",74.666666666666671]
["Rock-n-Roll",19,115,"D",45.877192982456137]
["Rockwood",19,69,"S",61.210526315789473]
["Rocky",20,74,"S",55.333333333333336]
["Rocky Road",23,78,"S",43.565217391304344]
["Rodeo",15,77,"S",81]
["Rogue",18,97,"D",56.555555555555557]
["Rojo",27,99,"S",26.25925925925926]
["Rokit",16,94,"D",68.666666666666671]
["Roland Edge",23,93,"S",38.565217391304344]
["Rolle",26,94,"D",30.205128205128208]
["Rolliker",15,80,"S",80]
["Rolo",18,82,"S",61.555555555555557]
["Roman",19,103,"S",49.877192982456137]
["Roman Candle",15,96,"S",74.666666666666657]
["Roman Flame",25,116,"D",25.333333333333336]
["Romeo",19,90,"S",54.210526315789473]
["Romeo's Juliet",20,70,"S",56.666666666666657]
["Romper",18,95,"S",57.222222222222229]
["Rona",23,61,"S",49.231884057971016]
["Roncalli",23,94,"D",38.231884057971016]
["Roo",22,100,"D",39.393939393939391]
["Rooe",20,72,"S",56]
["Roofus",15,96,"D",74.666666666666657]
["Rosa Belle",26,94,"S",30.205128205128208]
["Roscoe",20,73,"S",55.666666666666664]
["Rose",23,93,"D",38.565217391304344]
["Rose Bud",19,90,"S",54.210526315789473]
["Roseburg",15,71,"S",83]
["Rosemarie",18,68,"S",66.222222222222229]
["Rosey",15,64,"S",85.333333333333329]
["Rosie",27,114,"D",21.25925925925926]
["Rosie Sunshine",20,96,"D",48]
["Rosie's Dream",23,93,"D",38.565217391304344]
["Rosie's Rebel",20,116,"D",41.333333333333329]
["Roswel",22,66,"S",50.727272727272727]
["Rouge",17,72,"S",70.117647058823536]
["Rough Rebel",23,98,"D",36.898550724637673]
["Rough Springs",22,99,"S",39.727272727272727]
["Roulette",26,86,"S",32.871794871794869]
["Rowdy",16,71,"S",76.333333333333329]
["Roxy",19,72,"S",60.210526315789473]
["Royal",21,95,"D",44.523809523809526]
["Royal Athlete",20,73,"S",55.666666666666664]
["Royal Bill",23,86,"S",40.89855072463768]
["Royal Commander",20,99,"D",47]
["Royal Duchess",22,90,"S",42.727272727272727]
["Royal Empire",26,62,"S",40.871794871794869]
["Royal Star",26,100,"D",28.205128205128212]
["Royal Supernova",19,101,"D",50.543859649122808]
["Ruby",15,59,"S",87]
["Ruby Moon",25,78,"S",38]
["Ruby Slippers",20,117,"D",41]
["Rude Awakening",16,78,"S",74]
["Rudi",26,85,"S",33.205128205128204]
["Rudolph",19,74,"S",59.543859649122808]
["Rudy",19,81,"S",57.210526315789473]
["Ruemoss Delight",22,88,"S",43.393939393939391]
["Ruger",19,106,"D",48.877192982456137]
["Ruler's Secret",19,116,"S",45.543859649122808]
["Run 2 the Limit",18,81,"S",61.888888888888886]
["Run for the Roses",26,60,"S",41.53846153846154]
["Run love",21,105,"S",41.19047619047619]
["Running For Freedom",19,71,"S",60.543859649122808]
["Running Squirrel",21,94,"S",44.857142857142854]
["Running Thunder",19,87,"S",55.210526315789473]
["Rupert",23,59,"S",49.898550724637687]
["Russian Gold",20,59,"S",60.333333333333343]
["Rustic Sunrise",23,97,"D",37.231884057971023]
["Rustic Trublue",21,85,"S",47.857142857142861]
["Rusty",22,105,"S",37.727272727272727]
["Rusty Scupper",22,94,"S",41.393939393939391]
["Ryck O Shay",19,85,"S",55.877192982456137]
["S. H (super horse)",20,90,"S",50]
["S.O.S",22,76,"S",47.393939393939391]
["Saab",16,59,"S",80.333333333333329]
["Sable",18,91,"S",58.555555555555557]
["Sabre",21,86,"S",47.523809523809526]
["Sabrina",23,96,"D",37.565217391304344]
["Sacred Spirit",19,93,"S",53.210526315789473]
["Sadie",20,66,"S",58]
["SadieKing",22,86,"S",44.060606060606062]
["Saffron",19,94,"D",52.877192982456137]
["Sage",17,99,"D",61.117647058823529]
["Sagebrush Annie",25,81,"S",37]
["Sagen",16,64,"S",78.666666666666671]
["Sahara",23,82,"S",42.231884057971016]
["Said In Spun Silver",19,86,"S",55.543859649122808]
["Saint Philip",16,81,"S",73]
["Sako",15,115,"D",68.333333333333343]
["Salem",21,76,"S",50.857142857142861]
["Sally",26,97,"S",29.205128205128212]
["Salsa",26,59,"S",41.871794871794876]
["Salsa Mystery",17,78,"S",68.117647058823536]
["Salt Water Taffee",25,117,"S",25]
["Saltwater Taffy",24,108,"D",30.666666666666668]
["Sam",19,74,"S",59.543859649122808]
["Sam I Am",24,73,"S",42.333333333333329]
["Samara",15,72,"S",82.666666666666657]
["Samba Dancer",16,94,"D",68.666666666666671]
["Sambuca",24,75,"S",41.666666666666671]
["Sammie",25,86,"S",35.333333333333336]
["Sammy",15,93,"S",75.666666666666657]
["Sampson",21,81,"S",49.19047619047619]
["Sam's mentor",25,89,"S",34.333333333333336]
["Sam's Sugar Shack",26,110,"S",24.871794871794869]
["Samson",19,123,"S",43.210526315789473]
["San Domingo",20,98,"D",47.333333333333329]
["Sancho",23,106,"D",34.231884057971023]
["Sancy Girl",19,75,"S",59.210526315789473]
["Sandman",21,63,"S",55.19047619047619]
["Sandshine",21,91,"S",45.857142857142854]
["Sandy",19,90,"S",54.210526315789473]
["Sandy's Last Dance",22,82,"S",45.393939393939391]
["Sanibel",26,88,"S",32.205128205128204]
["Sans Marino",26,118,"D",22.205128205128212]
["Santa",18,81,"S",61.888888888888886]
["Santana",19,99,"D",51.210526315789473]
["Santos",22,76,"S",47.393939393939391]
["Sapphire",25,66,"S",42]
["Sarah",26,64,"S",40.205128205128204]
["Sargent",25,78,"S",38]
["Sarsaparilla",21,108,"S",40.19047619047619]
["Sasha",27,112,"D",21.925925925925931]
["Sassafrass Roots",16,90,"S",70]
["Sassy",21,69,"S",53.19047619047619]
["Sassy Baby",16,119,"S",60.333333333333336]
["Satan",18,87,"S",59.888888888888886]
["Satan's Promise",17,114,"D",56.117647058823529]
["Sateen",19,71,"S",60.543859649122808]
["Satin",21,79,"S",49.857142857142861]
["Satine",20,99,"D",47]
["Satisfaction Guaranteed",20,64,"S",58.666666666666657]
["Saturday Affair",25,116,"S",25.333333333333336]
["Saturn",15,89,"S",77]
["Saudi Arabia",15,82,"S",79.333333333333329]
["Saudi's Mighty Lady",25,88,"S",34.666666666666664]
["Savana",19,84,"S",56.210526315789473]
["Savannah",19,100,"S",50.877192982456137]
["Save The Best For Last",15,118,"S",67.333333333333343]
["Saxon Rose",21,98,"S",43.523809523809518]
["Saxson",18,91,"S",58.555555555555557]
["Say It Ain't So",19,71,"S",60.543859649122808]
["Say what",25,76,"S",38.666666666666664]
["Say-so",20,90,"S",50]
["Scarlet",19,109,"S",47.877192982456137]
["Scarlet O' Paradise",22,91,"S",42.393939393939391]
["Scarlett",20,88,"S",50.666666666666671]
["Schnee (german for snow)",22,89,"S",43.060606060606062]
["Scho Can Do",22,76,"S",47.393939393939391]
["Schooner",27,89,"S",29.592592592592595]
["Scooby",24,76,"S",41.333333333333329]
["Scooby Dooby Doo",26,100,"S",28.205128205128212]
["Scooter",22,67,"S",50.393939393939391]
["Score",18,76,"S",63.555555555555557]
["Scottie",16,69,"S",77]
["Scottish Lass",20,79,"S",53.666666666666671]
["Scotty",25,97,"D",31.666666666666664]
["Scout",15,88,"S",77.333333333333329]
["Scratch",20,59,"S",60.333333333333343]
["Scratch Me Not",21,109,"S",39.857142857142861]
["Scribbles",19,94,"D",52.877192982456137]
["Sea biscuit",22,90,"S",42.727272727272727]
["Seamus",27,88,"S",29.925925925925924]
["Sebastian",22,99,"S",39.727272727272727]
["Sebulba",22,80,"S",46.060606060606062]
["Secoya",22,68,"S",50.060606060606062]
["Secret",22,81,"S",45.727272727272727]
["Selcier",26,121,"D",21.205128205128201]
["Selena",20,93,"D",49]
["Senator",25,115,"S",25.666666666666664]
["Seneca",17,72,"S",70.117647058823536]
["Seneka",21,90,"S",46.19047619047619]
["Senna",25,107,"D",28.333333333333336]
["Señorita",22,120,"D",32.727272727272727]
["Sensation",24,77,"S",41]
["Senshi",21,83,"S",48.523809523809526]
["Sent From Above",24,86,"S",38]
["September",19,67,"S",61.877192982456137]
["Serendipity",27,72,"S",35.25925925925926]
["Serenity",27,96,"D",27.25925925925926]
["Sergent diablo",23,81,"S",42.565217391304344]
["Seritza",15,80,"S",80]
["Seth",22,87,"S",43.727272727272727]
["Sevana",15,90,"S",76.666666666666657]
["Sevaritza",17,69,"S",71.117647058823536]
["Seyton",22,72,"S",48.727272727272727]
["Shabas",25,117,"D",25]
["Shaboom",21,98,"D",43.523809523809518]
["Shades of Gray",22,91,"S",42.393939393939391]
["Shades of Midnight Glory",24,71,"S",43]
["Shadow",21,89,"S",46.523809523809526]
["Shadow Dancer",26,67,"S",39.205128205128204]
["Shadow in the Mist",22,89,"S",43.060606060606062]
["Shadow Joe",21,101,"D",42.523809523809518]
["Shadow of Moonlight",20,85,"S",51.666666666666671]
["Shadowed Rose",18,75,"S",63.888888888888886]
["Shadowfax",18,100,"D",55.555555555555557]
["Shadows",22,84,"S",44.727272727272727]
["Shadows Hidden Dream",16,66,"S",78]
["Shadows in the Mist",16,80,"S",73.333333333333329]
["Shady",25,122,"S",23.333333333333336]
["Shadyb",16,95,"S",68.333333333333329]
["Shae",19,76,"S",58.877192982456137]
["Shah",22,94,"D",41.393939393939391]
["Shakan",23,98,"D",36.898550724637673]
["Shall we Dance",22,99,"D",39.727272727272727]
["Shallow Hal",20,100,"D",46.666666666666671]
["Shallowmar",27,85,"S",30.925925925925924]
["Shalom",17,76,"S",68.784313725490193]
["Sham",21,83,"S",48.523809523809526]
["Shamal",22,75,"S",47.727272727272727]
["Shaman",16,95,"S",68.333333333333329]
["Shamara",16,90,"S",70]
["Shamin",22,93,"D",41.727272727272727]
["Shamrock",22,68,"S",50.060606060606062]
["Shamrock Lady68",21,60,"S",56.19047619047619]
["Shamus",24,76,"S",41.333333333333329]
["Shandy",22,59,"S",53.060606060606062]
["Shane",20,61,"S",59.666666666666657]
["Shanita",21,98,"S",43.523809523809518]
["Shannon",15,97,"S",74.333333333333343]
["Shanti (means peace)",19,85,"S",55.877192982456137]
["Shanty",15,81,"S",79.666666666666657]
["Share Me Toodles",21,77,"S",50.523809523809526]
["Sharpie",20,118,"S",40.666666666666671]
["Shasta",23,99,"S",36.565217391304344]
["Shasta moon",16,97,"D",67.666666666666657]
["Shawdow's Pride",21,93,"D",45.19047619047619]
["Shawnee",22,80,"S",46.060606060606062]
["Shaylan",16,116,"D",61.333333333333336]
["Sheba",25,76,"S",38.666666666666664]
["Shebe",27,100,"S",25.925925925925927]
["SheDaisy",24,88,"S",37.333333333333329]
["Sheena",22,76,"S",47.393939393939391]
["Sheena's Golden Nugget",25,64,"S",42.666666666666657]
["Sheer Trouble",17,61,"S",73.784313725490193]
["Sheeva",21,60,"S",56.19047619047619]
["Sheik",17,68,"S",71.450980392156865]
["Shelby",15,76,"S",81.333333333333329]
["Shera",16,70,"S",76.666666666666671]
["Sherbet",24,89,"S",37]
["Shergar",17,101,"D",60.450980392156858]
["Sherif of Notingham",24,83,"S",39]
["Sherlock Holmes",16,109,"D",63.666666666666664]
["Sherman",15,90,"S",76.666666666666657]
["Sherreef",27,90,"S",29.25925925925926]
["Sherri",20,75,"S",55]
["Sherrif",22,123,"S",31.727272727272727]
["Sherwin",25,91,"S",33.666666666666664]
["She's all That",18,74,"S",64.222222222222229]
["She's All That Jazz",24,94,"S",35.333333333333329]
["Shesa",16,91,"S",69.666666666666671]
["Shesa Easy Dream",24,92,"S",36]
["Shetan (arabic for devil)",23,103,"D",35.231884057971023]
["Sheyanne",19,87,"S",55.210526315789473]
["Sheza",17,93,"D",63.117647058823529]
["Sheza Desert Rose",20,81,"S",53]
["Shianne",20,89,"S",50.333333333333329]
["Shilo",27,80,"S",32.592592592592595]
["Shiloh",17,106,"D",58.784313725490208]
["Shiloh`s Trooper",25,68,"S",41.333333333333343]
["Shimmaree",21,62,"S",55.523809523809518]
["Shimmer",22,79,"S",46.393939393939391]
["Shindeagan (means Beautiful Star)",21,64,"S",54.857142857142861]
["Shindig",24,113,"D",29]
["Shinegami (Goddess of Death)",17,93,"D",63.117647058823529]
["Shining",16,83,"S",72.333333333333329]
["Shining Example",26,103,"D",27.205128205128212]
["Shining star",20,63,"S",59]
["Shiniqua",24,120,"S",26.666666666666664]
["Shinning Glory",21,86,"S",47.523809523809526]
["Shirley",21,86,"S",47.523809523809526]
["Shiver",20,95,"S",48.333333333333329]
["Shizsaad",15,95,"S",75]
["Shocker",20,76,"S",54.666666666666664]
["Shooting Star",19,78,"S",58.210526315789473]
["Short Story",19,94,"D",52.877192982456137]
["Shorty",18,88,"S",59.555555555555557]
["ShotGun",22,110,"D",36.060606060606062]
["Show Me Chism",21,76,"S",50.857142857142861]
["Show me the money",17,123,"S",53.117647058823529]
["Show N Tell",20,59,"S",60.333333333333343]
["Showdow Lark",23,73,"S",45.231884057971016]
["Showdown",27,82,"S",31.925925925925924]
["Showmen",16,74,"S",75.333333333333329]
["Shutter Bug",18,72,"S",64.888888888888886]
["Shuttle Bus",20,101,"D",46.333333333333329]
["Shy",19,98,"S",51.543859649122808]
["Shy Boy",25,99,"S",31]
["Shy Dandee",24,113,"D",29]
["Shyanne",21,102,"D",42.19047619047619]
["Shyboy",25,74,"S",39.333333333333336]
["Shyguy",20,82,"S",52.666666666666671]
["Sicsic",20,69,"S",57]
["Sid",20,96,"S",48]
["Sidney",27,99,"D",26.25925925925926]
["Sierra",19,63,"S",63.210526315789473]
["Sierra Nevada",26,88,"S",32.205128205128204]
["Sierra's Legacy",18,98,"S",56.222222222222221]
["Sierra's Sweet Rain",18,87,"S",59.888888888888886]
["Siesta",16,108,"S",64]
["Silence",26,82,"S",34.205128205128204]
["Silent Gray Fellow",26,89,"S",31.871794871794869]
["Silent Mist",18,80,"S",62.222222222222229]
["Silhouette",17,78,"S",68.117647058823536]
["Silk",17,110,"D",57.450980392156858]
["Silky",20,90,"S",50]
["Silly",24,75,"S",41.666666666666671]
["Silvara",26,105,"S",26.53846153846154]
["Silver",21,86,"S",47.523809523809526]
["Silver and Gold",17,75,"S",69.117647058823536]
["Silver Angel Beauty",22,101,"S",39.060606060606062]
["Silver Belle",24,100,"D",33.333333333333336]
["Silver Dollar",24,65,"S",45]
["Silver Flames",25,61,"S",43.666666666666671]
["Silver Knight",17,72,"S",70.117647058823536]
["Silver Lady",23,123,"D",28.565217391304348]
["Silver Lining",25,60,"S",44]
["Silver Marks",25,75,"S",39]
["Silver Moon",17,95,"S",62.450980392156865]
["Silver Satan",27,77,"S",33.592592592592595]
["Silver Seraph",21,87,"S",47.19047619047619]
["Silver Set",21,111,"D",39.19047619047619]
["Silver Spirit",15,101,"S",73]
["Silver Storm",18,100,"D",55.555555555555557]
["Silver Wind",22,101,"D",39.060606060606062]
["Silverwood",23,90,"S",39.565217391304344]
["Simba",15,89,"S",77]
["Simmon",21,68,"S",53.523809523809526]
["Simon",19,92,"D",53.543859649122808]
["Simple Obsession",19,123,"D",43.210526315789473]
["Simple Solution",21,91,"S",45.857142857142854]
["Simplicity",27,70,"S",35.925925925925924]
["Simply Dillon",20,112,"S",42.666666666666671]
["Simply Magestic",24,63,"S",45.666666666666671]
["Simply Sensational",19,72,"S",60.210526315789473]
["Simply Special",18,75,"S",63.888888888888886]
["Simply Spot",15,59,"S",87]
["Sinbad",17,81,"S",67.117647058823536]
["Sintana Strata",21,80,"S",49.523809523809526]
["Siobhan",27,61,"S",38.925925925925924]
["Sioux",17,106,"D",58.784313725490208]
["Sir Charles",25,90,"S",34]
["Sir Kick-a-lot",21,70,"S",52.857142857142861]
["Sir Lancelot",25,75,"S",39]
["Sir Nedrick",21,84,"S",48.19047619047619]
["Sir Patch",17,76,"S",68.784313725490193]
["Sir Prince",21,99,"D",43.19047619047619]
["Sir Prize",15,98,"D",74]
["Sir Reginald",21,94,"S",44.857142857142854]
["Sir Trooper",19,70,"S",60.877192982456137]
["Sirius",22,122,"S",32.060606060606062]
["Siroco",22,119,"D",33.060606060606062]
["Sisco",16,96,"D",68]
["Sissy",23,90,"S",39.565217391304344]
["Sister",24,91,"S",36.333333333333329]
["Sizzler",19,89,"S",54.543859649122808]
["Sizzling Cisco",24,76,"S",41.333333333333329]
["Sk8terboi ",24,89,"S",37]
["Skeeter",21,99,"S",43.19047619047619]
["Skip",22,60,"S",52.727272727272727]
["Skip A Beat Kid",17,84,"S",66.117647058823536]
["Skippa",19,74,"S",59.543859649122808]
["Skipper",26,92,"D",30.871794871794869]
["Skippers Cool Rainbo",21,102,"D",42.19047619047619]
["Skippers Midnight Bar",22,75,"S",47.727272727272727]
["Skippy",22,91,"S",42.393939393939391]
["Skips Sweet Dreams",26,116,"S",22.871794871794869]
["Skittles",26,87,"S",32.53846153846154]
["Skor",20,74,"S",55.333333333333336]
["Skwirt",20,87,"S",51]
["Sky",26,102,"S",27.53846153846154]
["Sky Classic",20,81,"S",53]
["Sky Dancer",19,91,"S",53.877192982456137]
["Sky Flyer",18,60,"S",68.888888888888886]
["Sky Master",15,85,"S",78.333333333333329]
["Sky Rocket",20,83,"S",52.333333333333329]
["Sky Song",25,110,"D",27.333333333333336]
["Skybound",21,112,"S",38.857142857142861]
["Skycab",23,60,"S",49.565217391304344]
["Skydance",22,70,"S",49.393939393939391]
["Skydancer",16,95,"D",68.333333333333329]
["Skye",17,76,"S",68.784313725490193]
["Skye's The Limit",17,75,"S",69.117647058823536]
["Skyla",17,87,"S",65.117647058823536]
["Skylark",22,121,"D",32.393939393939391]
["Skyler",19,65,"S",62.543859649122808]
["Sky's the Limit",21,73,"S",51.857142857142861]
["Skysong",18,80,"S",62.222222222222229]
["Skywalker",16,94,"D",68.666666666666671]
["Slate",23,90,"S",39.565217391304344]
["Sleepless in Seattle",22,107,"S",37.060606060606062]
["Slew Baby",25,94,"S",32.666666666666664]
["Slick",25,84,"S",36]
["Sling",21,82,"S",48.857142857142861]
["Slinky Dog",19,110,"D",47.543859649122808]
["Slippers",19,120,"S",44.210526315789473]
["Slippy",24,76,"S",41.333333333333329]
["Slow Show Shimer",19,111,"D",47.210526315789473]
["Sly",20,76,"S",54.666666666666664]
["Small Change",27,63,"S",38.25925925925926]
["Smartie",17,81,"S",67.117647058823536]
["Smartie",19,79,"S",57.877192982456137]
["Smokey",15,80,"S",80]
["Smokin' Jo Horn",19,76,"S",58.877192982456137]
["Smokin' Jo Horn",20,89,"S",50.333333333333329]
["Smokin Satin Bars",24,102,"D",32.666666666666664]
["Smoors",21,83,"S",48.523809523809526]
["Smooth Flight",21,85,"S",47.857142857142861]
["Smooth Passin Dude",21,98,"D",43.523809523809518]
["Snake",18,83,"S",61.222222222222229]
["Snap Dragon",19,72,"S",60.210526315789473]
["Snapple",16,91,"S",69.666666666666671]
["Snappy",16,109,"D",63.666666666666664]
["Sneak Preview",26,86,"S",32.871794871794869]
["Sneakers",16,82,"S",72.666666666666671]
["Snicker Doodle",22,87,"S",43.727272727272727]
["Snickerdoodledandy",23,85,"S",41.231884057971016]
["Snickers",15,108,"D",70.666666666666657]
["Snip",27,109,"D",22.925925925925931]
["Sniper",18,75,"S",63.888888888888886]
["Snipper",24,72,"S",42.666666666666671]
["Snoopy",18,79,"S",62.555555555555557]
["Snoozy",22,70,"S",49.393939393939391]
["Snow",19,98,"D",51.543859649122808]
["Snow Bird",21,76,"S",50.857142857142861]
["Snow Dancer",16,88,"S",70.666666666666671]
["Snow Feather",26,74,"S",36.871794871794869]
["Snow Storm",20,109,"S",43.666666666666671]
["Snow White",21,72,"S",52.19047619047619]
["Snowball",19,80,"S",57.543859649122808]
["Snowey",19,94,"S",52.877192982456137]
["Snowflake",23,85,"S",41.231884057971016]
["Snowflake Revenge",21,68,"S",53.523809523809526]
["Snowflakes Irish Dream",19,88,"S",54.877192982456137]
["Snowhite",20,79,"S",53.666666666666671]
["Snowy",21,108,"S",40.19047619047619]
["Snowy",15,113,"S",69]
["So Perfect",20,103,"S",45.666666666666671]
["Social Security",21,89,"S",46.523809523809526]
["Sockowitz",16,77,"S",74.333333333333329]
["Socks",17,113,"S",56.450980392156858]
["Soho",27,80,"S",32.592592592592595]
["Solar Blaze",27,64,"S",37.925925925925924]
["Solar Eclipse",24,77,"S",41]
["Solar Flare",15,88,"S",77.333333333333329]
["Solaris",15,75,"S",81.666666666666657]
["Soleil",25,79,"S",37.666666666666664]
["Solmyr",18,119,"S",49.222222222222221]
["Solo",20,73,"S",55.666666666666664]
["Solomon",21,84,"S",48.19047619047619]
["Solomon Grundy",27,60,"S",39.25925925925926]
["Solon",18,76,"S",63.555555555555557]
["Some Fantastic",20,73,"S",55.666666666666664]
["Something Different",24,105,"D",31.666666666666668]
["Something Special",24,103,"S",32.333333333333336]
["Something to Remember",27,98,"S",26.592592592592588]
["Something To Talk About",26,67,"S",39.205128205128204]
["Sommer",25,84,"S",36]
["Song",23,109,"D",33.231884057971023]
["Song of the South",19,75,"S",59.210526315789473]
["Songstress",26,74,"S",36.871794871794869]
["Sonic",27,110,"D",22.592592592592588]
["Sonny",19,82,"S",56.877192982456137]
["Sonny Dee Zippin",15,101,"S",73]
["Sonnys Oakie Twister",19,91,"S",53.877192982456137]
["Sony",19,76,"S",58.877192982456137]
["Soozy",22,77,"S",47.060606060606062]
["Sound Reason",22,80,"S",46.060606060606062]
["South Street",26,92,"S",30.871794871794869]
["Southern Belle",22,89,"S",43.060606060606062]
["Southern comfort",21,74,"S",51.523809523809526]
["Southern Dixie Pride",21,111,"D",39.19047619047619]
["Southern Drawl",25,75,"S",39]
["Spaghetti",22,97,"S",40.393939393939391]
["Spanky",22,85,"S",44.393939393939391]
["Sparkey",20,95,"S",48.333333333333329]
["Sparkler",20,66,"S",58]
["Sparkling Sapphire",24,90,"S",36.666666666666664]
["Sparky",17,119,"D",54.450980392156858]
["Spartan",20,72,"S",56]
["Special Dark",27,96,"S",27.25925925925926]
["Special Edition",23,121,"S",29.231884057971023]
["Special Effects",18,79,"S",62.555555555555557]
["Speckles",20,98,"D",47.333333333333329]
["Speed",20,84,"S",52]
["Speedy",21,107,"S",40.523809523809518]
["Speedy Gonzales",19,90,"S",54.210526315789473]
["Spencer",26,73,"S",37.205128205128204]
["Spice",25,118,"S",24.666666666666664]
["Spider",15,72,"S",82.666666666666657]
["Spiffy",24,62,"S",46]
["Spike",19,82,"S",56.877192982456137]
["Spikel",16,89,"S",70.333333333333329]
["Spinner",16,77,"S",74.333333333333329]
["Spirit",22,80,"S",46.060606060606062]
["Spirit of the West",17,87,"S",65.117647058823536]
["Spirit Within",22,111,"D",35.727272727272727]
["Spirited Swift Wind",20,96,"S",48]
["Spitfire",16,70,"S",76.666666666666671]
["Splash",20,111,"D",43]
["Splash Of Class",20,96,"S",48]
["Splash of Honey",20,77,"S",54.333333333333329]
["Splendid Export",21,85,"S",47.857142857142861]
["Splendor",20,85,"S",51.666666666666671]
["Splish-Splash",21,74,"S",51.523809523809526]
["Split Decision",15,81,"S",79.666666666666657]
["Splotch",20,101,"D",46.333333333333329]
["Spock",25,109,"S",27.666666666666664]
["Spoof",15,73,"S",82.333333333333329]
["Spook",19,98,"S",51.543859649122808]
["Spooky",24,85,"S",38.333333333333329]
["Sport",23,82,"S",42.231884057971016]
["Sport-n-Style",26,113,"D",23.871794871794869]
["Sporto",23,92,"S",38.89855072463768]
["Spot",21,84,"S",48.19047619047619]
["Spot a Dot",24,79,"S",40.333333333333329]
["Spots",27,71,"S",35.592592592592595]
["Sprite",19,69,"S",61.210526315789473]
["Sprocket",24,74,"S",42]
["Spunky",21,96,"D",44.19047619047619]
["Sputnick,",23,70,"S",46.231884057971016]
["Spy",27,120,"S",19.25925925925926]
["Squiggy",27,78,"S",33.25925925925926]
["Squirrel",25,99,"D",31]
["Srawberry Shortcake",21,95,"D",44.523809523809526]
["St.Andrew",25,120,"D",24]
["Sta Puff Marshmallow Man",16,84,"S",72]
["Stadium Jumper",21,88,"S",46.857142857142861]
["Stallion",24,121,"D",26.333333333333336]
["Standing Ovation",23,92,"S",38.89855072463768]
["Stanley",19,84,"S",56.210526315789473]
["Star",19,93,"D",53.210526315789473]
["Star",20,99,"S",47]
["Star \"O\" Wonder",23,98,"D",36.898550724637673]
["Star Dust",21,106,"D",40.857142857142861]
["Star Gazer",21,77,"S",50.523809523809526]
["Star Puff",20,93,"D",49]
["Star Status",20,83,"S",52.333333333333329]
["Star Struck",16,84,"S",72]
["Star Studded",19,74,"S",59.543859649122808]
["Star Trail",22,80,"S",46.060606060606062]
["Star Trek",24,82,"S",39.333333333333329]
["Star Wind",22,60,"S",52.727272727272727]
["Starbright",22,85,"S",44.393939393939391]
["Starbuck",22,98,"S",40.060606060606062]
["Starburst",19,82,"S",56.877192982456137]
["Starburst Doll",18,85,"S",60.555555555555557]
["Starburst Dynamite",15,86,"S",78]
["Stardust",21,112,"D",38.857142857142861]
["Starduster",21,93,"D",45.19047619047619]
["Stardust's Shine",26,79,"S",35.205128205128204]
["Stargazer",27,95,"D",27.592592592592595]
["Starlett",17,59,"S",74.450980392156865]
["Starlight",22,85,"S",44.393939393939391]
["Starlight Gazer",20,90,"S",50]
["Starlight silver",27,111,"S",22.25925925925926]
["Starling",19,70,"S",60.877192982456137]
["Starlit",21,78,"S",50.19047619047619]
["Starman",18,97,"D",56.555555555555557]
["Starr",22,76,"S",47.393939393939391]
["Starshine",16,82,"S",72.666666666666671]
["Starstruck",23,95,"S",37.89855072463768]
["Starz",21,95,"S",44.523809523809526]
["Starzao",17,120,"D",54.117647058823529]
["Staying the best",16,63,"S",79]
["Stealy Dan",17,78,"S",68.117647058823536]
["Steamer",23,94,"D",38.231884057971016]
["Steel Force",16,91,"S",69.666666666666671]
["Steelsings",21,74,"S",51.523809523809526]
["Stella",21,63,"S",55.19047619047619]
["Stella Artois of Loxley",15,94,"S",75.333333333333329]
["Stellar",22,94,"D",41.393939393939391]
["Stepin Out",19,60,"S",64.21052631578948]
["Steppin' It Out",20,103,"S",45.666666666666671]
["Steppin' Out",19,79,"S",57.877192982456137]
["Steppin' Stars",27,86,"S",30.592592592592595]
["Sterling",25,70,"S",40.666666666666657]
["Sterling Dreamz",24,79,"S",40.333333333333329]
["Sterling Silver",26,93,"S",30.53846153846154]
["Sterling's Dream",22,91,"S",42.393939393939391]
["Stevie",25,92,"D",33.333333333333336]
["Stewball",25,72,"S",40]
["Stone",27,72,"S",35.25925925925926]
["Stone Hinger",27,59,"S",39.592592592592595]
["Stoney",20,65,"S",58.333333333333343]
["Stony",26,79,"S",35.205128205128204]
["Storm",21,69,"S",53.19047619047619]
["Storm Cloud",16,89,"S",70.333333333333329]
["Storm Front",23,118,"D",30.231884057971023]
["Storm Watch",16,105,"D",65]
["Storm's Destiny",22,70,"S",49.393939393939391]
["Storm's Ransom",20,90,"S",50]
["Stormy",25,60,"S",44]
["Stormy Knight",27,95,"D",27.592592592592595]
["Story",16,93,"D",69]
["Straberry Shortcake",27,87,"S",30.25925925925926]
["Straight Arrow",27,69,"S",36.25925925925926]
["Strappa",15,71,"S",83]
["Strawberries and Cake",17,74,"S",69.450980392156865]
["Strawberry",16,109,"S",63.666666666666664]
["Strawberry Dream",19,89,"S",54.543859649122808]
["Strawberry Wine",26,112,"S",24.205128205128212]
["Streak",17,119,"S",54.450980392156858]
["Streaker",20,74,"S",55.333333333333336]
["Street Jammer",15,86,"S",78]
["Strictly Overtime",25,84,"S",36]
["Strider",24,90,"S",36.666666666666664]
["Stripe",17,107,"D",58.450980392156858]
["Stroking Commotion",19,86,"S",55.543859649122808]
["Stryker",16,70,"S",76.666666666666671]
["Sub Zero",22,78,"S",46.727272727272727]
["Sudden Explosion",21,89,"S",46.523809523809526]
["Sueno",22,73,"S",48.393939393939391]
["Suey",22,122,"D",32.060606060606062]
["Sugar",19,83,"S",56.543859649122808]
["Sugar & Spice",21,116,"D",37.523809523809518]
["Sugar Baby",22,84,"S",44.727272727272727]
["Sugar Foot",27,105,"S",24.25925925925926]
["Sugar N Spice",19,60,"S",64.21052631578948]
["Sugar Twin",18,121,"S",48.555555555555557]
["Sugarfoot (Mina)",16,71,"S",76.333333333333329]
["Sugar-n-Spice",15,78,"S",80.666666666666657]
["Sugars Delight",19,117,"S",45.210526315789473]
["Sugar's Pride",20,72,"S",56]
["Suki",20,113,"D",42.333333333333329]
["Sukura",20,86,"S",51.333333333333329]
["Sullivan",22,96,"D",40.727272727272727]
["Sully",21,95,"D",44.523809523809526]
["Sultan",23,91,"S",39.231884057971016]
["Summer",15,111,"S",69.666666666666657]
["Summer Breeze",15,123,"S",65.666666666666671]
["Summer Eclipse",22,91,"S",42.393939393939391]
["Summer Sensation",20,87,"S",51]
["Summer's Breeze",22,90,"S",42.727272727272727]
["Summit",22,73,"S",48.393939393939391]
["Summoner",16,93,"D",69]
["Sun Dancer",21,85,"S",47.857142857142861]
["Sun Raider",25,77,"S",38.333333333333336]
["Sunbriar",25,69,"S",41]
["Suncatcher Baby",18,95,"D",57.222222222222229]
["Sunchaser",20,123,"D",39]
["Sundance",23,89,"S",39.89855072463768]
["Sundancer",15,93,"S",75.666666666666657]
["Sundancer Melody",25,94,"D",32.666666666666664]
["Sunday Silence",26,122,"S",20.871794871794876]
["Sundrop",27,90,"S",29.25925925925926]
["Sunfire",24,92,"D",36]
["Sunkist",24,79,"S",40.333333333333329]
["Sunlight",19,94,"D",52.877192982456137]
["Sunny",21,98,"S",43.523809523809518]
["Sunny Bono",22,123,"D",31.727272727272727]
["Sunny Day",19,99,"S",51.210526315789473]
["Sunny Delight",18,103,"S",54.555555555555557]
["Sunny Second",23,90,"S",39.565217391304344]
["Sunrise",16,99,"D",67]
["Sunsational Girl",21,106,"S",40.857142857142861]
["Sunshine",22,94,"S",41.393939393939391]
["Sunshine Heart",24,76,"S",41.333333333333329]
["Sunzoray",19,98,"S",51.543859649122808]
["Super Cowboy",15,84,"S",78.666666666666657]
["Super Man",21,78,"S",50.19047619047619]
["Super Model",18,59,"S",69.222222222222229]
["Super Nova",22,104,"D",38.060606060606062]
["Super Star",17,76,"S",68.784313725490193]
["Superman",20,90,"S",50]
["Superstar",25,77,"S",38.333333333333336]
["Supersticous",21,88,"S",46.857142857142861]
["Superstitious Satisfaction",22,74,"S",48.060606060606062]
["Suppose",18,118,"D",49.555555555555557]
["Supreme",22,75,"S",47.727272727272727]
["Sure Thing",18,93,"D",57.888888888888886]
["Surf Dancer",16,67,"S",77.666666666666671]
["Surprise",18,102,"D",54.888888888888886]
["Survivor",22,113,"S",35.060606060606062]
["Susie",16,83,"S",72.333333333333329]
["Suzie Q",20,96,"S",48]
["Swallo",15,90,"S",76.666666666666657]
["Sweat Dreams",22,77,"S",47.060606060606062]
["Sweet as Sugar",25,73,"S",39.666666666666664]
["Sweet Breeze",22,59,"S",53.060606060606062]
["Sweet Dreams",26,71,"S",37.871794871794869]
["Sweet Emotion",19,78,"S",58.210526315789473]
["Sweet Kisses In The Moonlight",17,88,"S",64.784313725490193]
["Sweet Medicine",24,75,"S",41.666666666666671]
["Sweet Melody",21,73,"S",51.857142857142861]
["Sweet N Zippo",21,93,"S",45.19047619047619]
["Sweet Pea",15,93,"D",75.666666666666657]
["Sweet Pea",20,64,"S",58.666666666666657]
["Sweet Red Wine",19,112,"D",46.877192982456137]
["Sweet Revenge",16,59,"S",80.333333333333329]
["Sweet Rhythm and Blues",15,71,"S",83]
["Sweet Rum Can Do",19,78,"S",58.210526315789473]
["Sweet Sandy Girl",20,60,"S",60]
["Sweet Sensation",15,87,"S",77.666666666666657]
["Sweet Tea",26,91,"S",31.205128205128208]
["Sweet Winter",24,60,"S",46.666666666666671]
["Sweetart",24,92,"S",36]
["Sweetie",21,93,"S",45.19047619047619]
["Sweetness Is",15,93,"D",75.666666666666657]
["Swirl",19,117,"D",45.210526315789473]
["Sydney",21,65,"S",54.523809523809518]
["Sylvester",20,83,"S",52.333333333333329]
["Symphony",15,100,"D",73.333333333333343]
["Syncopation",25,66,"S",42]
["Taffy",16,90,"S",70]
["Tagi",19,92,"D",53.543859649122808]
["Tahoe",21,100,"S",42.857142857142861]
["Taiga",21,76,"S",50.857142857142861]
["Tail Spin",18,101,"D",55.222222222222221]
["Tajsh Serrion",25,78,"S",38]
["Take A Gambit",22,90,"S",42.727272727272727]
["Talented love",17,82,"S",66.784313725490193]
["Talleyrand",27,95,"S",27.592592592592595]
["Tallyesson",19,93,"D",53.210526315789473]
["Talyn",21,77,"S",50.523809523809526]
["Talzanna",21,112,"D",38.857142857142861]
["Tamara",22,76,"S",47.393939393939391]
["Tambourine",19,112,"D",46.877192982456137]
["Tami",22,85,"S",44.393939393939391]
["Tamika",20,78,"S",54]
["Tammy",24,105,"D",31.666666666666668]
["Tang",18,123,"D",47.888888888888886]
["Tango",21,87,"S",47.19047619047619]
["Tango Goin Cash",22,94,"D",41.393939393939391]
["Tanis",19,73,"S",59.877192982456137]
["Tanna",20,85,"S",51.666666666666671]
["Tanner",24,91,"S",36.333333333333329]
["Tantor",19,76,"S",58.877192982456137]
["Tara",24,88,"S",37.333333333333329]
["Taragon",15,121,"S",66.333333333333343]
["Target's Grand Splash",21,83,"S",48.523809523809526]
["Tarot",20,74,"S",55.333333333333336]
["Tarzan",21,88,"S",46.857142857142861]
["Tash",25,92,"S",33.333333333333336]
["Tasha",21,81,"S",49.19047619047619]
["Tater",15,94,"D",75.333333333333329]
["Tater Tot",27,97,"S",26.925925925925927]
["Tatonka Ohwashe",20,77,"S",54.333333333333329]
["Tator",22,59,"S",53.060606060606062]
["Tattoo",17,79,"S",67.784313725490193]
["Tawny",26,89,"S",31.871794871794869]
["Taxi",20,92,"D",49.333333333333329]
["Taydee",16,68,"S",77.333333333333329]
["Taylor",26,110,"D",24.871794871794869]
["Taylor Made",16,92,"S",69.333333333333329]
["Taylor Made Fantasy",15,97,"D",74.333333333333343]
["Taz",17,74,"S",69.450980392156865]
["Taz Mania",22,101,"S",39.060606060606062]
["Tazman",27,113,"S",21.592592592592592]
["T-bone",19,116,"D",45.543859649122808]
["Tea Buiscet",20,96,"D",48]
["Tea For Two",21,100,"D",42.857142857142861]
["Tea Leaves",24,75,"S",41.666666666666671]
["Tea Spoon",23,108,"S",33.565217391304344]
["Teach",17,73,"S",69.784313725490193]
["Teacher's Pet",26,91,"S",31.205128205128208]
["Teardrops and Rose",16,74,"S",75.333333333333329]
["Tease",26,62,"S",40.871794871794869]
["Teasle",23,101,"S",35.898550724637673]
["Tebo",27,74,"S",34.592592592592595]
["Ted",24,74,"S",42]
["Teddy",19,122,"D",43.543859649122808]
["Teddy Bear",21,93,"S",45.19047619047619]
["Teddy Bear--Bear",20,85,"S",51.666666666666671]
["Teddy Boy",23,71,"S",45.89855072463768]
["Tedwin",19,71,"S",60.543859649122808]
["Teebaby",21,111,"D",39.19047619047619]
["TeeJay",20,92,"D",49.333333333333329]
["Teko",19,71,"S",60.543859649122808]
["Tell Me A Fable",15,94,"D",75.333333333333329]
["Temper",23,88,"S",40.231884057971016]
["Tempo",24,98,"S",34]
["Temptress",19,123,"D",43.210526315789473]
["Tender Mist",25,69,"S",41]
["Tenneche",22,115,"D",34.393939393939391]
["Tennessee Tuxedo",19,96,"D",52.210526315789473]
["Tens Golden Nugget",27,67,"S",36.925925925925924]
["Tequila",24,87,"S",37.666666666666664]
["Tequila Sunrise",22,87,"S",43.727272727272727]
["Tequilla",20,90,"S",50]
["Tess",26,74,"S",36.871794871794869]
["Tess Lady Bug",24,84,"S",38.666666666666664]
["Tessa",16,71,"S",76.333333333333329]
["Tex",21,113,"D",38.523809523809518]
["Texas",22,103,"D",38.393939393939391]
["Texas Rodeo",18,85,"S",60.555555555555557]
["Text",23,80,"S",42.89855072463768]
["Thade",24,70,"S",43.333333333333329]
["That's the bulk of them",19,123,"D",43.210526315789473]
["That's the Idea",20,75,"S",55]
["Thaw",22,78,"S",46.727272727272727]
["The American Way",25,62,"S",43.333333333333343]
["The Duke",18,100,"D",55.555555555555557]
["The Flying Wonder",24,88,"S",37.333333333333329]
["The General",20,67,"S",57.666666666666657]
["The Ghost is Dancing",22,119,"S",33.060606060606062]
["The Milky Bar Kid",26,59,"S",41.871794871794876]
["The Outlaw",26,107,"S",25.871794871794869]
["The Patriot",16,79,"S",73.666666666666671]
["The Secrets Out",21,79,"S",49.857142857142861]
["The Sky's the Limit",26,69,"S",38.53846153846154]
["The Super Conductor",21,109,"D",39.857142857142861]
["The Whiskey Bandit",22,93,"S",41.727272727272727]
["Theo",21,91,"S",45.857142857142854]
["Theodorable",18,117,"S",49.888888888888886]
["Think",19,114,"D",46.210526315789473]
["Think Of It",24,83,"S",39]
["Third Degree",16,88,"S",70.666666666666671]
["Thomas",22,87,"S",43.727272727272727]
["Thor",22,79,"S",46.393939393939391]
["Thowra",27,78,"S",33.25925925925926]
["Thuderstorm",19,67,"S",61.877192982456137]
["Thumbelina",22,121,"S",32.393939393939391]
["Thumper",23,71,"S",45.89855072463768]
["Thunder",19,76,"S",58.877192982456137]
["Thunder Bolt",17,80,"S",67.450980392156865]
["Thunder Jam",17,75,"S",69.117647058823536]
["Thunderhead",20,87,"S",51]
["Thunderjam",16,100,"S",66.666666666666657]
["'Ti Gars",22,76,"S",47.393939393939391]
["Tia",15,120,"D",66.666666666666671]
["Tiara",25,97,"S",31.666666666666664]
["Tic Tac",21,112,"D",38.857142857142861]
["Tico",22,105,"D",37.727272727272727]
["Tiddly-winks",24,60,"S",46.666666666666671]
["Tido",16,82,"S",72.666666666666671]
["Tiffy",19,85,"S",55.877192982456137]
["Tifton",23,84,"S",41.565217391304344]
["Tiger",16,83,"S",72.333333333333329]
["Tiger Lily",21,79,"S",49.857142857142861]
["Tigger",25,84,"S",36]
["Tigre",22,75,"S",47.727272727272727]
["Tilly",25,84,"S",36]
["Tim Buck 2",15,100,"S",73.333333333333343]
["Timber",17,75,"S",69.117647058823536]
["Tin Man",22,72,"S",48.727272727272727]
["Tink",27,77,"S",33.592592592592595]
["Tinkerbell",18,85,"S",60.555555555555557]
["Tiny",17,96,"D",62.117647058823529]
["Tip Toeing To Success",21,88,"S",46.857142857142861]
["Tippy",20,75,"S",55]
["Tishia/Tishya",24,79,"S",40.333333333333329]
["Titan",15,73,"S",82.333333333333329]
["Titan It Up Jack",21,71,"S",52.523809523809526]
["Titus",22,75,"S",47.727272727272727]
["TJ",21,93,"D",45.19047619047619]
["To Be Cherished",20,81,"S",53]
["To Close For Comfort",20,99,"D",47]
["Tobasco",18,85,"S",60.555555555555557]
["Tobiana",21,99,"S",43.19047619047619]
["Tobie",23,88,"S",40.231884057971016]
["Toby",21,78,"S",50.19047619047619]
["Tocker",22,73,"S",48.393939393939391]
["Todd",21,121,"D",35.857142857142861]
["Tody",19,62,"S",63.543859649122808]
["Toffee",19,86,"S",55.543859649122808]
["Tokai",25,78,"S",38]
["Tola",22,72,"S",48.727272727272727]
["Tolo",27,95,"D",27.592592592592595]
["Tom Fool",19,67,"S",61.877192982456137]
["Tomboy",27,79,"S",32.925925925925924]
["Tomcat",16,70,"S",76.666666666666671]
["Tommy",15,121,"S",66.333333333333343]
["Tomorrow's Dreams",19,74,"S",59.543859649122808]
["Tongo",20,82,"S",52.666666666666671]
["Tonka",15,86,"S",78]
["Tonka Truck",15,80,"S",80]
["Tono",27,72,"S",35.25925925925926]
["Tonto",26,87,"S",32.53846153846154]
["Tony",25,76,"S",38.666666666666664]
["Too Hot To Handle",20,67,"S",57.666666666666657]
["Tooter",18,71,"S",65.222222222222229]
["Tootie Frutie",19,90,"S",54.210526315789473]
["Tootles",21,93,"S",45.19047619047619]
["Top Cat",19,92,"D",53.543859649122808]
["Top Hat",18,73,"S",64.555555555555557]
["Top of the Line",22,87,"S",43.727272727272727]
["Top Prize",24,109,"S",30.333333333333336]
["Top Quality",16,101,"D",66.333333333333343]
["Top Score",19,68,"S",61.543859649122808]
["Top Secret",19,76,"S",58.877192982456137]
["Top Story",21,103,"S",41.857142857142861]
["Top Style",20,86,"S",51.333333333333329]
["Topanga",23,85,"S",41.231884057971016]
["Topanna",19,81,"S",57.210526315789473]
["Topaz",19,93,"S",53.210526315789473]
["Topic",22,79,"S",46.393939393939391]
["Topnotch",27,118,"S",19.925925925925927]
["Topside",20,78,"S",54]
["Tora",20,116,"S",41.333333333333329]
["Torahka (Hebrew-Carrier of the Law)",22,76,"S",47.393939393939391]
["Torch",21,101,"S",42.523809523809518]
["Tori",22,70,"S",49.393939393939391]
["Toric",23,96,"S",37.565217391304344]
["Torigon",27,81,"S",32.25925925925926]
["Tornado",23,81,"S",42.565217391304344]
["Toronto",17,106,"D",58.784313725490208]
["Torque",18,105,"S",53.888888888888886]
["Total Rebellion",22,73,"S",48.393939393939391]
["Touch",20,83,"S",52.333333333333329]
["Touch of Class",22,101,"D",39.060606060606062]
["Touch of Dandy",27,66,"S",37.25925925925926]
["Touch of Faith",15,95,"D",75]
["Touch of Frost",18,81,"S",61.888888888888886]
["Tough Opposition",16,97,"S",67.666666666666657]
["Toy",16,98,"S",67.333333333333343]
["Toyland",20,120,"S",40]
["Trace",19,93,"S",53.210526315789473]
["Tracer",25,100,"S",30.666666666666664]
["Tracker",19,69,"S",61.210526315789473]
["Traditional Style",16,84,"S",72]
["Trail Blazer",19,79,"S",57.877192982456137]
["Tramp",24,76,"S",41.333333333333329]
["Trapper",25,69,"S",41]
["Travaldo",24,74,"S",42]
["Traveler",19,79,"S",57.877192982456137]
["Travelers Proud Poco",21,90,"S",46.19047619047619]
["Travlers Delieght",19,59,"S",64.543859649122808]
["Travlin Man",20,112,"S",42.666666666666671]
["Trax",17,73,"S",69.784313725490193]
["Treacle",19,78,"S",58.210526315789473]
["Treasure",21,67,"S",53.857142857142861]
["Treke",21,79,"S",49.857142857142861]
["Trevor",17,93,"D",63.117647058823529]
["Trey",27,81,"S",32.25925925925926]
["Tribulation",20,90,"S",50]
["Tribute",18,82,"S",61.555555555555557]
["Tricks",25,97,"D",31.666666666666664]
["Trigger",20,79,"S",53.666666666666671]
["Trinity",20,116,"S",41.333333333333329]
["Trio",20,97,"D",47.666666666666671]
["Triple Treat",22,73,"S",48.393939393939391]
["Triples",23,89,"S",39.89855072463768]
["Tripp",25,67,"S",41.666666666666657]
["Tristan",22,61,"S",52.393939393939391]
["Triton",18,115,"S",50.555555555555557]
["Trixie",25,96,"S",32]
["Trixies Cool Rainbow",16,77,"S",74.333333333333329]
["Trocadero",23,68,"S",46.89855072463768]
["Trojan",25,100,"D",30.666666666666664]
["Tronto",15,90,"S",76.666666666666657]
["Trooper",19,121,"S",43.877192982456137]
["Troubles",20,63,"S",59]
["Trudy",25,97,"S",31.666666666666664]
["True Confidence",20,96,"D",48]
["True Stepper",20,74,"S",55.333333333333336]
["True Zippo",21,93,"D",45.19047619047619]
["Truffles",22,122,"D",32.060606060606062]
["Truly Intelligent",24,71,"S",43]
["Truska",22,70,"S",49.393939393939391]
["Try Me Hot",22,72,"S",48.727272727272727]
["Trylan Aire",18,92,"S",58.222222222222229]
["Tubby",21,101,"S",42.523809523809518]
["Tucker",27,94,"D",27.925925925925924]
["Tuff",21,93,"S",45.19047619047619]
["Tuff E Nuff Zippo",22,66,"S",50.727272727272727]
["Tuffy",17,81,"S",67.117647058823536]
["Tulsa",22,71,"S",49.060606060606062]
["Tumbleweed",18,79,"S",62.555555555555557]
["Tune",19,77,"S",58.543859649122808]
["Tunka",24,83,"S",39]
["Tuppence",16,94,"D",68.666666666666671]
["Turbo",17,116,"S",55.450980392156858]
["Turk",19,87,"S",55.210526315789473]
["Turning Point",17,76,"S",68.784313725490193]
["Turtle",15,90,"S",76.666666666666657]
["Tuvok",22,88,"S",43.393939393939391]
["Tux",21,76,"S",50.857142857142861]
["Tuxedo",21,85,"S",47.857142857142861]
["Twain",15,59,"S",87]
["Twenty-Eleven",20,65,"S",58.333333333333343]
["Twice",22,97,"S",40.393939393939391]
["Twiggs",18,88,"S",59.555555555555557]
["Twilight",16,74,"S",75.333333333333329]
["Twilight Zone",26,84,"S",33.53846153846154]
["Twin",22,97,"D",40.393939393939391]
["Twinkie",25,79,"S",37.666666666666664]
["Twinkle",19,99,"S",51.210526315789473]
["Twinkle Toes",19,116,"S",45.543859649122808]
["Twist n' Shout",21,69,"S",53.19047619047619]
["Twist N Time",21,123,"S",35.19047619047619]
["Twisted Noodle",16,88,"S",70.666666666666671]
["Twister",20,88,"S",50.666666666666671]
["Twlight Tossin' It Up",22,92,"S",42.060606060606062]
["Two Bits",20,86,"S",51.333333333333329]
["Two Socks",16,65,"S",78.333333333333329]
["Two to Tango",24,117,"S",27.666666666666664]
["Ty",19,66,"S",62.210526315789473]
["Tyra",19,68,"S",61.543859649122808]
["Tyrees Pride",15,79,"S",80.333333333333329]
["Tyson",27,97,"S",26.925925925925927]
["Tzar Bria",27,101,"D",25.592592592592588]
["U For Me",18,70,"S",65.555555555555557]
["Uakea (means Misty)",27,107,"S",23.592592592592588]
["Uaki",18,63,"S",67.888888888888886]
["Uila (means Lightening)",19,101,"S",50.543859649122808]
["Ula",26,102,"S",27.53846153846154]
["Ultimate Best",22,123,"S",31.727272727272727]
["Ultimate Depth",19,109,"D",47.877192982456137]
["Ultimate Height",17,85,"S",65.784313725490193]
["Ultimate Risk",24,72,"S",42.666666666666671]
["Ulyses",22,121,"S",32.393939393939391]
["Ulysses",19,113,"D",46.543859649122808]
["Uma (girl in Japanese)",26,98,"D",28.871794871794865]
["Umbra",24,75,"S",41.666666666666671]
["Un Poco",24,80,"S",40]
["Unagi",22,92,"D",42.060606060606062]
["Unannounced Pleasure",15,76,"S",81.333333333333329]
["Unbridled Dreams",21,82,"S",48.857142857142861]
["Uncas",20,66,"S",58]
["Undecided",18,69,"S",65.888888888888886]
["Under Par",20,89,"S",50.333333333333329]
["Under The Stars",20,70,"S",56.666666666666657]
["Underdog",25,76,"S",38.666666666666664]
["Understandably",26,112,"D",24.205128205128212]
["Unexpected visitor",21,115,"S",37.857142857142861]
["Uniquess",27,69,"S",36.25925925925926]
["Unity",27,87,"S",30.25925925925926]
["Universal",18,101,"D",55.222222222222221]
["Unnstoppable",27,74,"S",34.592592592592595]
["Uno",21,75,"S",51.19047619047619]
["Uno Mas",22,92,"D",42.060606060606062]
["Untamed Desert",20,113,"S",42.333333333333329]
["Unusual",16,64,"S",78.666666666666671]
["Up, Up and away",26,72,"S",37.53846153846154]
["Upwell",21,87,"S",47.19047619047619]
["Urban Cowboy",22,77,"S",47.060606060606062]
["Urban Cowgirl",21,94,"D",44.857142857142854]
["Urko",26,88,"S",32.205128205128204]
["Ursa",24,61,"S",46.333333333333329]
["Ursula",25,80,"S",37.333333333333336]
["Utara",20,103,"S",45.666666666666671]
["Uther",21,78,"S",50.19047619047619]
["Utopia",27,76,"S",33.925925925925924]
["Vagabond",26,71,"S",37.871794871794869]
["Val",17,80,"S",67.450980392156865]
["Valentine",21,81,"S",49.19047619047619]
["Valentino",22,65,"S",51.060606060606062]
["Valley",22,101,"S",39.060606060606062]
["Valley Whisper",19,81,"S",57.210526315789473]
["Value Point",16,100,"D",66.666666666666657]
["Van Gogh",16,113,"D",62.333333333333336]
["Vandy",19,88,"S",54.877192982456137]
["Vanilla",17,70,"S",70.784313725490193]
["Vanilla Rose",18,64,"S",67.555555555555557]
["Vanity",17,72,"S",70.117647058823536]
["Vanity Fair",16,120,"D",60]
["Varsity",21,73,"S",51.857142857142861]
["Vassili",25,78,"S",38]
["Vebula",26,95,"S",29.871794871794869]
["Vedette",20,97,"D",47.666666666666671]
["Vega",27,60,"S",39.25925925925926]
["Vegas",21,63,"S",55.19047619047619]
["Velocity",18,75,"S",63.888888888888886]
["Velvet",19,95,"S",52.543859649122808]
["Velvet Blackjack",19,80,"S",57.543859649122808]
["Venture",20,104,"D",45.333333333333329]
["Venus",20,90,"S",50]
["Verdun",21,72,"S",52.19047619047619]
["Verona",25,123,"D",23]
["Verse",27,76,"S",33.925925925925924]
["Vertical Limit",25,80,"S",37.333333333333336]
["Vice Versa",22,64,"S",51.393939393939391]
["Vicky",27,93,"D",28.25925925925926]
["Victor",22,83,"S",45.060606060606062]
["Victorias Secret",21,60,"S",56.19047619047619]
["Victory",22,74,"S",48.060606060606062]
["Victory Blues",23,94,"S",38.231884057971016]
["Viking",22,75,"S",47.727272727272727]
["Villain",24,76,"S",41.333333333333329]
["Vincent",16,80,"S",73.333333333333329]
["Vinnie",24,105,"D",31.666666666666668]
["Vinny",18,81,"S",61.888888888888886]
["Violence",25,107,"S",28.333333333333336]
["Violent Storm",25,69,"S",41]
["Virgo",17,97,"S",61.784313725490208]
["Virtual Reality",22,98,"S",40.060606060606062]
["Visa Mastercard",25,96,"D",32]
["Visa Vi",24,73,"S",42.333333333333329]
["Vito",19,113,"S",46.543859649122808]
["Vivace",25,96,"D",32]
["Vixen",24,74,"S",42]
["Vogue",20,103,"D",45.666666666666671]
["Volano",18,78,"S",62.888888888888886]
["Voyager",17,86,"S",65.450980392156865]
["Wakita",18,73,"S",64.555555555555557]
["Waldo",26,111,"D",24.53846153846154]
["Walk on the Wild Side",19,82,"S",56.877192982456137]
["Walk on the wild side",22,79,"S",46.393939393939391]
["Walker",15,98,"S",74]
["Walking Thunder",20,113,"S",42.333333333333329]
["Wallflower",25,98,"D",31.333333333333336]
["Walter",22,84,"S",44.727272727272727]
["Wanna Red Checker",27,97,"D",26.925925925925927]
["Wapiti",22,103,"D",38.393939393939391]
["Warned",15,75,"S",81.666666666666657]
["Warrior",22,88,"S",43.393939393939391]
["Warrior Ace",15,87,"S",77.666666666666657]
["Watch This",19,87,"S",55.210526315789473]
["Water Music",16,98,"S",67.333333333333343]
["Watson",16,99,"S",67]
["Waylan",20,59,"S",60.333333333333343]
["Wayland Blues",20,65,"S",58.333333333333343]
["Waylon",20,121,"D",39.666666666666671]
["Waylon Jennings",16,85,"S",71.666666666666671]
["WazUp Sunshine",26,96,"D",29.53846153846154]
["Webster",23,119,"D",29.898550724637676]
["Wench",17,60,"S",74.117647058823536]
["Wesley",22,76,"S",47.393939393939391]
["West",22,72,"S",48.727272727272727]
["Westbound",27,76,"S",33.925925925925924]
["Westerly Winds",27,107,"D",23.592592592592588]
["Western Spark",19,101,"S",50.543859649122808]
["Weston",23,59,"S",49.898550724637687]
["Westpoint",22,92,"D",42.060606060606062]
["Wexford",22,66,"S",50.727272727272727]
["What A Wonder",19,71,"S",60.543859649122808]
["What Dreams may come True",24,103,"D",32.333333333333336]
["Whatever",22,92,"S",42.060606060606062]
["Wheels",20,82,"S",52.666666666666671]
["When Lightning Strikes",26,84,"S",33.53846153846154]
["Where It's At",24,123,"S",25.666666666666664]
["Whipping Wind",22,116,"S",34.060606060606062]
["Whiskey",18,86,"S",60.222222222222229]
["Whiskey River",19,79,"S",57.877192982456137]
["Whisky",27,77,"S",33.592592592592595]
["Whisky Gen",21,83,"S",48.523809523809526]
["Whisper",17,83,"S",66.450980392156865]
["Whispering Spirit",20,105,"D",45]
["Whita",23,96,"S",37.565217391304344]
["White Christmas",20,112,"D",42.666666666666671]
["White Darkness",20,101,"D",46.333333333333329]
["White Dove",25,74,"S",39.333333333333336]
["White Lightening,",21,101,"S",42.523809523809518]
["White Lightning",22,94,"D",41.393939393939391]
["White Magic",25,99,"D",31]
["White Prince",20,82,"S",52.666666666666671]
["White River",19,79,"S",57.877192982456137]
["White Rose",17,109,"D",57.784313725490208]
["White Snowflakes",21,79,"S",49.857142857142861]
["White Wash",21,64,"S",54.857142857142861]
["Whitley",22,69,"S",49.727272727272727]
["Why Not",22,80,"S",46.060606060606062]
["Why Not Me?",21,74,"S",51.523809523809526]
["Wiard",17,92,"D",63.450980392156865]
["Wide Awake In Dream Land",19,109,"S",47.877192982456137]
["Wilbur",22,66,"S",50.727272727272727]
["Wild at Heart",19,99,"D",51.210526315789473]
["Wild Buck",19,74,"S",59.543859649122808]
["Wild Card",20,90,"S",50]
["Wild Card",22,101,"D",39.060606060606062]
["Wild Child",20,96,"D",48]
["Wild Eye",22,103,"S",38.393939393939391]
["Wild Fire",17,65,"S",72.450980392156865]
["Wild Magic",21,118,"S",36.857142857142861]
["Wild Rose",15,61,"S",86.333333333333329]
["Wild Son",20,76,"S",54.666666666666664]
["Wild Sun",20,77,"S",54.333333333333329]
["Wild Thang",20,91,"S",49.666666666666671]
["Wild Thing",22,64,"S",51.393939393939391]
["Wildcat",20,88,"S",50.666666666666671]
["Wilder Wein",16,79,"S",73.666666666666671]
["Wildfire",22,89,"S",43.060606060606062]
["Wildfire Sensation",25,84,"S",36]
["Wildwind",20,88,"S",50.666666666666671]
["Wiley",17,59,"S",74.450980392156865]
["Wilky",24,99,"D",33.666666666666664]
["Will",20,80,"S",53.333333333333329]
["Will if I Want",15,105,"S",71.666666666666657]
["William",26,117,"S",22.53846153846154]
["Willie",21,82,"S",48.857142857142861]
["Willie West",21,72,"S",52.19047619047619]
["Willow",24,94,"S",35.333333333333329]
["Wills",17,93,"D",63.117647058823529]
["Willy",16,93,"D",69]
["Wilma",22,75,"S",47.727272727272727]
["Winalot",22,90,"S",42.727272727272727]
["Wind",21,79,"S",49.857142857142861]
["Wind Breaker",27,108,"D",23.25925925925926]
["Wind Chaser",16,78,"S",74]
["Wind Dancer",18,71,"S",65.222222222222229]
["Wind Maker",23,89,"S",39.89855072463768]
["Wind of the North",22,78,"S",46.727272727272727]
["Wind Runner",22,75,"S",47.727272727272727]
["Wind Song",20,82,"S",52.666666666666671]
["Wind Whistler",22,85,"S",44.393939393939391]
["Windago",23,108,"S",33.565217391304344]
["Windchime",20,93,"D",49]
["Windjammer",16,64,"S",78.666666666666671]
["Windrunner",16,113,"S",62.333333333333336]
["Windsong",22,68,"S",50.060606060606062]
["Windsor",19,89,"S",54.543859649122808]
["Windstorm",27,72,"S",35.25925925925926]
["Windswept",21,81,"S",49.19047619047619]
["Windy",16,92,"S",69.333333333333329]
["Wing and a Prayer",19,80,"S",57.543859649122808]
["Wings",22,114,"D",34.727272727272727]
["Wings of Smoke",22,96,"D",40.727272727272727]
["Wingstar",16,89,"S",70.333333333333329]
["Winnie",23,76,"S",44.231884057971016]
["Winnie the Pooh",26,99,"S",28.53846153846154]
["Winning Glory",15,81,"S",79.666666666666657]
["Winning Player",22,90,"S",42.727272727272727]
["Winny",22,93,"S",41.727272727272727]
["Winslow",19,114,"D",46.210526315789473]
["Winsome",21,88,"S",46.857142857142861]
["Winston",18,74,"S",64.222222222222229]
["Winter Wonderland",19,92,"D",53.543859649122808]
["WinterGold",24,90,"S",36.666666666666664]
["Wisard",23,80,"S",42.89855072463768]
["Wish List",22,82,"S",45.393939393939391]
["Wish Upon A Star",23,100,"D",36.231884057971023]
["Wishful Thinking",23,105,"S",34.565217391304351]
["Wishin on a silver Star",19,103,"D",49.877192982456137]
["Witch Craft",19,108,"S",48.210526315789473]
["With All My Heart",22,86,"S",44.060606060606062]
["Without Makeup",27,79,"S",32.925925925925924]
["Wizard",18,114,"D",50.888888888888886]
["Wogglebug",25,97,"D",31.666666666666664]
["Wolf",18,64,"S",67.555555555555557]
["Wolves Howl",27,64,"S",37.925925925925924]
["Wombat",21,72,"S",52.19047619047619]
["Womble",19,112,"D",46.877192982456137]
["Wonder",19,95,"D",52.543859649122808]
["Wonder Blue",24,107,"D",30.999999999999996]
["Wonder Boy",21,88,"S",46.857142857142861]
["Wonder Stuff",20,73,"S",55.666666666666664]
["Wonders Champion",26,122,"D",20.871794871794876]
["Wonders Pride",16,85,"S",71.666666666666671]
["Wonders Princess",22,75,"S",47.727272727272727]
["Woodstock",26,101,"D",27.871794871794869]
["Woody",22,84,"S",44.727272727272727]
["Woohoo",21,77,"S",50.523809523809526]
["World Class",25,123,"S",23]
["World's Hero",20,92,"D",49.333333333333329]
["Worthwhile",22,99,"S",39.727272727272727]
["Wots up Doc",15,74,"S",82]
["Wouldn't Be Sweet",18,123,"D",47.888888888888886]
["Wrangler",21,121,"D",35.857142857142861]
["Wriggley",22,118,"D",33.393939393939391]
["Written in Verse",22,59,"S",53.060606060606062]
["X",20,73,"S",55.666666666666664]
["X Marks the Spot",23,59,"S",49.898550724637687]
["X Rated",24,122,"D",26]
["Xanadu",18,104,"S",54.222222222222221]
["Xander",21,119,"D",36.523809523809518]
["XanderRoman",25,105,"D",29]
["Xantoxu",22,93,"S",41.727272727272727]
["Xaohroa",17,101,"S",60.450980392156858]
["Xavier",24,72,"S",42.666666666666671]
["Xavior",22,71,"S",49.060606060606062]
["Xena",17,81,"S",67.117647058823536]
["Xenia",19,67,"S",61.877192982456137]
["Xerox",23,86,"S",40.89855072463768]
["Xerxes",16,65,"S",78.333333333333329]
["Xiao",27,86,"S",30.592592592592595]
["Xo",24,70,"S",43.333333333333329]
["X-run",21,80,"S",49.523809523809526]
["Xtina",15,84,"S",78.666666666666657]
["Xtreme",24,62,"S",46]
["Xylon",26,118,"S",22.205128205128212]
["Xylos",21,61,"S",55.857142857142861]
["Yager Meister",23,93,"S",38.565217391304344]
["Yago",21,69,"S",53.19047619047619]
["Yamasce",16,92,"D",69.333333333333329]
["Yankee",19,103,"D",49.877192982456137]
["Yankee Doodle",21,70,"S",52.857142857142861]
["Yarrman (Australian Aborigional for horse)",26,95,"D",29.871794871794869]
["Yellow",27,73,"S",34.925925925925924]
["Yellow Sky",26,84,"S",33.53846153846154]
["Yentel",24,66,"S",44.666666666666671]
["Yesterday",20,99,"S",47]
["Ying Yang",21,92,"D",45.523809523809526]
["Yoda",15,69,"S",83.666666666666657]
["Yogi",18,85,"S",60.555555555555557]
["Yogi",27,79,"S",32.925925925925924]
["Yorik",21,71,"S",52.523809523809526]
["York's Fashion Fare",19,110,"S",47.543859649122808]
["Yosemite",20,72,"S",56]
["Yoshi",22,74,"S",48.060606060606062]
["Yoshiko",17,70,"S",70.784313725490193]
["You Might Wonder",27,107,"S",23.592592592592588]
["You think?",20,82,"S",52.666666666666671]
["Yoyo",22,105,"D",37.727272727272727]
["Yuki",27,69,"S",36.25925925925926]
["Yukon",19,101,"D",50.543859649122808]
["Z",26,85,"S",33.205128205128204]
["Zace",20,107,"D",44.333333333333329]
["Zachary",24,103,"S",32.333333333333336]
["Zack",20,107,"D",44.333333333333329]
["Zack Attack",19,77,"S",58.543859649122808]
["Zaide",25,92,"D",33.333333333333336]
["Zalika",27,66,"S",37.25925925925926]
["Zan",22,91,"S",42.393939393939391]
["Zander",20,84,"S",52]
["Zane",18,86,"S",60.222222222222229]
["Zani",21,97,"S",43.857142857142861]
["Zanzibar",19,88,"S",54.877192982456137]
["Zara",26,74,"S",36.871794871794869]
["Zaracha",23,60,"S",49.565217391304344]
["Zazu",21,123,"D",35.19047619047619]
["Zebedee",22,114,"D",34.727272727272727]
["Zed",17,73,"S",69.784313725490193]
["Zeda",26,108,"D",25.53846153846154]
["Zeek",20,98,"D",47.333333333333329]
["Zeke",17,100,"D",60.784313725490208]
["Zelda",17,90,"S",64.117647058823536]
["Zen",16,79,"S",73.666666666666671]
["Zena",25,63,"S",43]
["Zenith",17,88,"S",64.784313725490193]
["Zenon",23,69,"S",46.565217391304344]
["Zepher",21,92,"S",45.523809523809526]
["Zephyr",16,96,"D",68]
["Zeplin",22,100,"S",39.393939393939391]
["Zeppia",26,82,"S",34.205128205128204]
["Zesta",16,87,"S",71]
["Zeus",23,68,"S",46.89855072463768]
["Zia",23,102,"S",35.565217391304351]
["Zig Zag",20,100,"S",46.666666666666671]
["Ziggy",16,107,"D",64.333333333333343]
["Zimbro",16,92,"D",69.333333333333329]
["Zinc",25,91,"S",33.666666666666664]
["Zip",20,113,"S",42.333333333333329]
["Zip Appeal",21,73,"S",51.857142857142861]
["Zip Me Up",19,98,"D",51.543859649122808]
["Ziploose N Fancy Free",22,97,"D",40.393939393939391]
["Zippidee Doo Dah",22,99,"D",39.727272727272727]
["Zippin' Old Stile",23,114,"D",31.565217391304348]
["Zippit",16,78,"S",74]
["Zippity Doodah",19,82,"S",56.877192982456137]
["Zippo",18,84,"S",60.888888888888886]
["Zippo Pine Shine",18,108,"D",52.888888888888886]
["Zippo's Sensation",20,112,"D",42.666666666666671]
["Zippy",18,79,"S",62.555555555555557]
["Zippy Chippie",22,96,"D",40.727272727272727]
["Zippy Kay",20,116,"D",41.333333333333329]
["Zips Dima a Day",21,105,"D",41.19047619047619]
["Zod",19,81,"S",57.210526315789473]
["Zodiac",17,69,"S",71.117647058823536]
["Zodiac Princess",16,80,"S",73.333333333333329]
["Zoe",22,107,"S",37.060606060606062]
["Zollie",19,93,"D",53.210526315789473]
["Zora",21,100,"S",42.857142857142861]
["Zorino",27,119,"D",19.592592592592592]
["Zorro",19,83,"S",56.543859649122808]
["Zorro Garlic",17,95,"D",62.450980392156865]
["Zorrow",22,62,"S",52.060606060606062]
["Zulu",21,106,"D",40.857142857142861]
["Zylan",24,121,"D",26.333333333333336]
["Bieber",10,40,"S",146.66666666666666]
["Angus Young",28,130,"D",13.809523809523817]
["Avenger",26,117,"D",22.53846153846154]
["Hulk",18,125,"S",47.222222222222221]
["Iron Man",25,100,{"$f":"IF(C4760>91,IF(RAND()>0.4,\"D\",\"S\"),\"S\")","v":"D"},30.666666666666664]
["Thor",24,108,"S",30.666666666666668]
["Captain America",22,127,"D",30.393939393939391]
["Ozzy",22,99,"D",39.727272727272727]
["RANDOM",{"$f":"IF(RAND()<0.5,RANDBETWEEN(15,22),RANDBETWEEN(19,27))","v":21},{"$f":"IF(RAND()<0.5,RANDBETWEEN(59,101),RANDBETWEEN(69,123))","v":73},{"$f":"IF(C4764>91,IF(RAND()>0.4,\"D\",\"S\"),\"S\")","v":"S"},{"$f":"(400-(B4764*C4764)/6)/(B4764/4)+C4764/3","v":51.857142857142861}]

{"sheet":"the race","index":1,"n_rows":39,"n_cols":26,"rows_kept":39,"cut":false,"hidden":false,"merged":[[33,9,33,11],[34,9,35,11],[16,1,16,11],[17,1,17,11],[27,1,27,2],[15,1,15,11],[10,1,10,11],[11,1,11,11],[12,1,12,11],[13,1,13,11],[14,1,14,11]]}
["horse","stamina remaining","distance","strategy","speed","stamina","stamina cost","move next turn","new stamina","new distance",null,"new horses","race times","race over?",null,"expected time",null,null,null,null,null,null,null,"APPLIED AGAINST ODDS","min roll","AGAINST ODDS? "]
["Perfect Winter",0,400,{"$f":"VLOOKUP(A2,horses!A:D,4,FALSE)","v":"S"},{"$f":"VLOOKUP(A2,horses!A:D,2,FALSE)","v":19},{"$f":"VLOOKUP(A2,horses!A:D,3,FALSE)","v":85},{"$f":"IF(AND(D2=\"D\",C2<80),1,MIN(3,B2))","v":0},{"$f":"IF(G2=0,RANDBETWEEN(Y2,ROUNDUP(E2*0.25,0)),RANDBETWEEN(Y2,ROUNDUP(E2*G2/3,0)))","v":2},{"$f":"B2-G2","v":0},{"$f":"MIN(400,C2+H2+IF(X2=1,ROUNDUP(SQRT(B20),0),0))","v":400},null,{"$f":"INDIRECT(ADDRESS(RANDBETWEEN(2,horses!$G$19),1,1,1,\"horses\"),TRUE)","v":"Pheonix"},79.8,{"$f":"IF(COUNTIF(M2:M9,\">0\")=8,1,0)","v":1},null,{"$f":"VLOOKUP(A2,horses!A:E,5,FALSE)","v":55.877192982456137},null,{"$f":"STANDARDIZE(P2,$P$11,$P$12)","v":0.40213183124634189},{"$f":"NORMSDIST(R2)","v":0.65620649616756765},{"$f":"1-S2","v":0.34379350383243235},{"$f":"T2/SUM($T$2:$T$9)","v":8.4849338096551624E-2},{"$f":"ROUNDUP(1/U2,0)","v":12},{"$f":"ROUNDUP(2*V2/MIN($V$2:$V$9),0)+X2","v":5},0,{"$f":"IF(B20>25,4,IF(B20>10,3,1))","v":1},{"$f":"IF(RAND()<1/B20,1,0)","v":0}]
["Foxy",0,400,{"$f":"VLOOKUP(A3,horses!A:D,4,FALSE)","v":"D"},{"$f":"VLOOKUP(A3,horses!A:D,2,FALSE)","v":21},{"$f":"VLOOKUP(A3,horses!A:D,3,FALSE)","v":95},0,{"$f":"IF(G3=0,RANDBETWEEN(Y3,ROUNDUP(E3*0.25,0)),RANDBETWEEN(Y3,ROUNDUP(E3*G3/3,0)))","v":1},{"$f":"B3-G3","v":0},{"$f":"MIN(400,C3+H3+IF(X3=1,ROUNDUP(SQRT(B21),0),0))","v":400},null,{"$f":"INDIRECT(ADDRESS(RANDBETWEEN(2,horses!$G$19),1,1,1,\"horses\"),TRUE)","v":"Zorro Garlic"},58,null,null,{"$f":"VLOOKUP(A3,horses!A:E,5,FALSE)","v":44.523809523809526},null,{"$f":"STANDARDIZE(P3,$P$11,$P$12)","v":-0.27478214331229539},{"$f":"NORMSDIST(R3)","v":0.39174180889157584},{"$f":"1-S3","v":0.60825819110842416},{"$f":"T3/SUM($T$2:$T$9)","v":0.15012007013521367},{"$f":"ROUNDUP(1/U3,0)","v":7},{"$f":"ROUNDUP(2*V3/MIN($V$2:$V$9),0)+X3","v":3},0,{"$f":"IF(B21>25,4,IF(B21>10,3,1))","v":1},{"$f":"IF(RAND()<1/B21,1,0)","v":0}]
["Arial",0,400,{"$f":"VLOOKUP(A4,horses!A:D,4,FALSE)","v":"S"},{"$f":"VLOOKUP(A4,horses!A:D,2,FALSE)","v":20},{"$f":"VLOOKUP(A4,horses!A:D,3,FALSE)","v":99},0,2,0,400,null,{"$f":"INDIRECT(ADDRESS(RANDBETWEEN(2,horses!$G$19),1,1,1,\"horses\"),TRUE)","v":"Sneak Preview"},31.09090909090909,null,null,{"$f":"VLOOKUP(A4,horses!A:E,5,FALSE)","v":47},null,-0.12714615945712243,0.44941235896818515,0.5505876410318149,0.13588679362732081,8,5,1,1,0]
["Beach",0,399,{"$f":"VLOOKUP(A5,horses!A:D,4,FALSE)","v":"S"},{"$f":"VLOOKUP(A5,horses!A:D,2,FALSE)","v":18},{"$f":"VLOOKUP(A5,horses!A:D,3,FALSE)","v":70},0,1,0,400,null,{"$f":"INDIRECT(ADDRESS(RANDBETWEEN(2,horses!$G$19),1,1,1,\"horses\"),TRUE)","v":"Adrian"},83.6,null,null,{"$f":"VLOOKUP(A5,horses!A:E,5,FALSE)","v":65.555555555555557},null,0.97917733494478343,0.83625381728279935,0.16374618271720065,4.0413082459415529E-2,25,10,0,1,0]
["Miscief",0,400,{"$f":"VLOOKUP(A6,horses!A:D,4,FALSE)","v":"S"},{"$f":"VLOOKUP(A6,horses!A:D,2,FALSE)","v":25},{"$f":"VLOOKUP(A6,horses!A:D,3,FALSE)","v":78},0,2,0,400,null,{"$f":"INDIRECT(ADDRESS(RANDBETWEEN(2,horses!$G$19),1,1,1,\"horses\"),TRUE)","v":"Shizsaad"},24.3,null,null,{"$f":"VLOOKUP(A6,horses!A:E,5,FALSE)","v":38},null,{"$f":"STANDARDIZE(P6,$P$11,$P$12)","v":-0.66374617769996291},0.25342638940196649,0.74657361059803351,0.18425675876200179,6,4,1,1,0]
["Text",0,400,{"$f":"VLOOKUP(A7,horses!A:D,4,FALSE)","v":"S"},{"$f":"VLOOKUP(A7,horses!A:D,2,FALSE)","v":23},{"$f":"VLOOKUP(A7,horses!A:D,3,FALSE)","v":80},0,3,0,400,null,{"$f":"INDIRECT(ADDRESS(RANDBETWEEN(2,horses!$G$19),1,1,1,\"horses\"),TRUE)","v":"Daddy's Overdraft"},30.5,null,null,{"$f":"VLOOKUP(A7,horses!A:E,5,FALSE)","v":42.89855072463768},null,-0.37168368789951201,0.35506418573667381,0.64493581426332613,0.15917222502748599,7,4,1,1,1]
["Tronto",0,400,{"$f":"VLOOKUP(A8,horses!A:D,4,FALSE)","v":"S"},{"$f":"VLOOKUP(A8,horses!A:D,2,FALSE)","v":15},{"$f":"VLOOKUP(A8,horses!A:D,3,FALSE)","v":90},0,4,0,400,null,{"$f":"INDIRECT(ADDRESS(RANDBETWEEN(2,horses!$G$19),1,1,1,\"horses\"),TRUE)","v":"Look At me Go"},64.5,null,null,{"$f":"VLOOKUP(A8,horses!A:E,5,FALSE)","v":76.666666666666657},null,1.6416464932692771,0.94966835679782369,5.0331643202176313E-2,1.2422010780919205E-2,81,33,0,4,0]
["Avenger",0,400,{"$f":"VLOOKUP(A9,horses!A:D,4,FALSE)","v":"D"},{"$f":"VLOOKUP(A9,horses!A:D,2,FALSE)","v":26},{"$f":"VLOOKUP(A9,horses!A:D,3,FALSE)","v":117},0,3,0,400,null,{"$f":"INDIRECT(ADDRESS(RANDBETWEEN(2,horses!$G$19),1,1,1,\"horses\"),TRUE)","v":"Cavier"},29.92,null,null,{"$f":"VLOOKUP(A9,horses!A:E,5,FALSE)","v":22.53846153846154},null,-1.5855974910915094,5.6415322872676567E-2,0.94358467712732341,0.2328797211110914,5,3,1,1,1]
[]
[{"$f":"A2","v":"Perfect Winter"},{"$f":"C2","v":400},null,null,null,null,null,null,null,null,null,null,null,null,null,{"$f":"AVERAGE(P2:P9)","v":49.132529623948386}]
[{"$f":"A3","v":"Foxy"},{"$f":"C3","v":400},null,null,null,null,null,null,null,null,null,null,null,null,null,{"$f":"STDEV(P2:P9)","v":16.772269276977575}]
["Arial",400]
["Beach",399]
["Miscief",400]
["Text",400]
["Tronto",400]
["Avenger",400]
["BETS","Odds","Time","Position"]
[{"$f":"A11","v":"Perfect Winter"},{"$f":"W2","v":5},{"$f":"M2","v":79.8},{"$f":"RANK(C20,$C$20:$C$27,1)","v":7}]
[{"$f":"A12","v":"Foxy"},{"$f":"W3","v":3},{"$f":"M3","v":58},{"$f":"RANK(C21,$C$20:$C$27,1)","v":5}]
["Arial",5,31.09090909090909,4]
["Beach",10,83.6,8]
["Miscief",4,24.3,1]
["Text",4,30.5,3]
["Tronto",33,64.5,6]
["Avenger",3,29.92,2]
[null,"Payout",null,{"$f":"D20*$A$29*$B$20+D21*$A$30*$B$21+D22*$A$31*$B$22+D23*$A$32*$B$23+D24*$A$33*$B$24+D25*$A$34*$B$25+D26*$A$35*$B$26+D27*$A$36*$B$27","v":11},{"$f":"E20*$A$29*$B$20+E21*$A$30*$B$21+E22*$A$31*$B$22+E23*$A$32*$B$23+E24*$A$33*$B$24+E25*$A$34*$B$25+E26*$A$35*$B$26+E27*$A$36*$B$27","v":0},0,0,0,0,0,0,0,0,0,0,0]
[{"$f":"IF(RANK(C20,$C$20:$C$27,1)=1,1,IF(RANK(C20,$C$20:$C$27,1)=2,0.5,IF(RANK(C20,$C$20:$C$27,1)=3,1/3,0)))","v":0},null,null,"*1st place: full payout; 2nd place: 1/2 payout; 3rd place: 1/3 payout"]
[0]
[0]
[0]
[1]
[0.33333333333333331,null,null,null,null,"Speed",0.1]
[0,null,null,null,null,null,null,null,null,"Enter name in box above then press button"]
[0.5]
[null,null,"Player",null,{"$f":"IF(E19=0,\"\",E19)","v":""},"","","","","","","","","","",""]
[null,null,"Cash",null,{"$f":"IFERROR(VLOOKUP(E37,players!$A:$D,2,FALSE),\"\")","v":""},{"$f":"IFERROR(VLOOKUP(F37,players!$A:$D,2,FALSE),\"\")","v":""},{"$f":"IFERROR(VLOOKUP(G37,players!$A:$D,2,FALSE),\"\")","v":""},{"$f":"IFERROR(VLOOKUP(H37,players!$A:$D,2,FALSE),\"\")","v":""},{"$f":"IFERROR(VLOOKUP(I37,players!$A:$D,2,FALSE),\"\")","v":""},{"$f":"IFERROR(VLOOKUP(J37,players!$A:$D,2,FALSE),\"\")","v":""},{"$f":"IFERROR(VLOOKUP(K37,players!$A:$D,2,FALSE),\"\")","v":""},{"$f":"IFERROR(VLOOKUP(L37,players!$A:$D,2,FALSE),\"\")","v":""},{"$f":"IFERROR(VLOOKUP(M37,players!$A:$D,2,FALSE),\"\")","v":""},{"$f":"IFERROR(VLOOKUP(N37,players!$A:$D,2,FALSE),\"\")","v":""},{"$f":"IFERROR(VLOOKUP(O37,players!$A:$D,2,FALSE),\"\")","v":""},{"$f":"IFERROR(VLOOKUP(P37,players!$A:$D,2,FALSE),\"\")","v":""}]
[null,null,"Average Winnings",null,{"$f":"IFERROR(VLOOKUP(E19,players!$A:$D,4,FALSE),\"\")","v":""},{"$f":"IFERROR(VLOOKUP(F19,players!$A:$D,4,FALSE),\"\")","v":""},{"$f":"IFERROR(VLOOKUP(G19,players!$A:$D,4,FALSE),\"\")","v":""},{"$f":"IFERROR(VLOOKUP(H19,players!$A:$D,4,FALSE),\"\")","v":""},{"$f":"IFERROR(VLOOKUP(I19,players!$A:$D,4,FALSE),\"\")","v":""},{"$f":"IFERROR(VLOOKUP(J19,players!$A:$D,4,FALSE),\"\")","v":""},{"$f":"IFERROR(VLOOKUP(K19,players!$A:$D,4,FALSE),\"\")","v":""},{"$f":"IFERROR(VLOOKUP(L19,players!$A:$D,4,FALSE),\"\")","v":""},{"$f":"IFERROR(VLOOKUP(M19,players!$A:$D,4,FALSE),\"\")","v":""},{"$f":"IFERROR(VLOOKUP(N19,players!$A:$D,4,FALSE),\"\")","v":""},{"$f":"IFERROR(VLOOKUP(O19,players!$A:$D,4,FALSE),\"\")","v":""},{"$f":"IFERROR(VLOOKUP(P19,players!$A:$D,4,FALSE),\"\")","v":""}]

{"sheet":"players","index":2,"n_rows":3,"n_cols":7,"rows_kept":3,"cut":false,"hidden":true,"merged":[]}
["Player","Cash","Number of Bets","Average Winnings",null,"Cash","Number of Bets"]
["TEMPLATE",1000,0,{"$f":"IFERROR((B2-1000)/C2,0)","v":0},null,{"$f":"B2+IFERROR(HLOOKUP(A2,'the race'!$D$19:$P$28,10,FALSE),0)-SUM(INDIRECT(ADDRESS(20,IFERROR(MATCH(A2,'the race'!$A$19:$P$19,0),1),1,1,\"the race\")&\":\"&ADDRESS(27,IFERROR(MATCH(A2,'the race'!$A$19:$P$19,0),1),1,1),TRUE))","v":1000},{"$f":"C2+IF(COUNTIF('the race'!$D$19:$P$19,players!A2)>0,1,0)","v":0}]
["TEMPLATE",1000,0,{"$f":"IFERROR((B3-1000)/C3,0)","v":0},null,{"$f":"B3+IFERROR(HLOOKUP(A3,'the race'!$D$19:$P$28,10,FALSE),0)-SUM(INDIRECT(ADDRESS(20,IFERROR(MATCH(A3,'the race'!$A$19:$P$19,0),1),1,1,\"the race\")&\":\"&ADDRESS(27,IFERROR(MATCH(A3,'the race'!$A$19:$P$19,0),1),1,1),TRUE))","v":1000},{"$f":"C3+IF(COUNTIF('the race'!$D$19:$P$19,players!A3)>0,1,0)","v":0}]